ACCESSION: MSBNK-Waters-WA000652
RECORD_TITLE: Sotalol; LC-ESI-Q; MS; POS; 45 V
DATE: 2016.01.19 (Created 2007.08.01, modified 2011.05.06)
AUTHORS: Nihon Waters K.K.
LICENSE: CC BY-NC

CH$NAME: Sotalol
CH$COMPOUND_CLASS: N/A
CH$FORMULA: C12H20N2O3S
CH$EXACT_MASS: 272.11946
CH$SMILES: CC(C)NCC(O)c(c1)ccc(c1)NS(C)(=O)=O
CH$IUPAC: InChI=1S/C12H20N2O3S/c1-9(2)13-8-12(15)10-4-6-11(7-5-10)14-18(3,16)17/h4-7,9,12-15H,8H2,1-3H3
CH$LINK: CAS 3930-20-9
CH$LINK: INCHIKEY ZBMZVLHSJCTVON-UHFFFAOYSA-N
CH$LINK: COMPTOX DTXSID0023589

AC$INSTRUMENT: ZQ, Waters
AC$INSTRUMENT_TYPE: LC-ESI-Q
AC$MASS_SPECTROMETRY: MS_TYPE MS
AC$MASS_SPECTROMETRY: ION_MODE POSITIVE
AC$MASS_SPECTROMETRY: IONIZATION ESI
AC$CHROMATOGRAPHY: RETENTION_TIME 5.300 min
AC$CHROMATOGRAPHY: COLUMN_NAME 2.1 mm id - 3. 5{mu}m XTerra C18MS
AC$CHROMATOGRAPHY: COLUMN_TEMPERATURE 35 C
AC$CHROMATOGRAPHY: SAMPLING_CONE 45 V

MS$DATA_PROCESSING: FIND_PEAK ignore rel.int. < 5

PK$SPLASH: splash10-0bt9-0390000000-7f2ca514a49518161712
PK$NUM_PEAK: 33
PK$PEAK: m/z int. rel.int.
  106 12 12
  108 12 12
  118 102 102
  119 31 31
  120 24 24
  126 8 8
  133 286 286
  134 121 121
  135 63 63
  154 16 16
  161 43 43
  165 12 12
  166 20 20
  176 121 121
  177 67 67
  182 8 8
  195 12 12
  198 8 8
  207 12 12
  209 8 8
  213 913 913
  214 63 63
  215 43 43
  216 8 8
  223 8 8
  225 12 12
  254 8 8
  255 999 999
  256 102 102
  257 47 47
  273 188 188
  274 16 16
  275 8 8