ACCESSION: MSBNK-Waters-WA000761
RECORD_TITLE: Naltrexone; LC-ESI-Q; MS; POS; 90 V
DATE: 2016.01.19 (Created 2007.08.01, modified 2011.05.06)
AUTHORS: Nihon Waters K.K.
LICENSE: CC BY-NC

CH$NAME: Naltrexone
CH$COMPOUND_CLASS: N/A
CH$FORMULA: C20H23NO4
CH$EXACT_MASS: 341.16271
CH$SMILES: Oc(c6)c(O5)c(c(c6)3)C(C1)(C45)C(O)(CCC(=O)4)C(C3)N(CC(C2)C2)C1
CH$IUPAC: InChI=1S/C20H23NO4/c22-13-4-3-12-9-15-20(24)6-5-14(23)18-19(20,16(12)17(13)25-18)7-8-21(15)10-11-1-2-11/h3-4,11,15,18,22,24H,1-2,5-10H2/t15-,18+,19+,20-/m1/s1
CH$LINK: CAS 16590-41-3
CH$LINK: INCHIKEY DQCKKXVULJGBQN-XFWGSAIBSA-N
CH$LINK: COMPTOX DTXSID4046313

AC$INSTRUMENT: ZQ, Waters
AC$INSTRUMENT_TYPE: LC-ESI-Q
AC$MASS_SPECTROMETRY: MS_TYPE MS
AC$MASS_SPECTROMETRY: ION_MODE POSITIVE
AC$MASS_SPECTROMETRY: IONIZATION ESI
AC$CHROMATOGRAPHY: RETENTION_TIME 11.200 min
AC$CHROMATOGRAPHY: COLUMN_NAME 2.1 mm id - 3. 5{mu}m XTerra C18MS
AC$CHROMATOGRAPHY: COLUMN_TEMPERATURE 35 C
AC$CHROMATOGRAPHY: SAMPLING_CONE 90 V

MS$DATA_PROCESSING: FIND_PEAK ignore rel.int. < 5

PK$SPLASH: splash10-03di-0592000000-7d314f1cfad17a49773f
PK$NUM_PEAK: 146
PK$PEAK: m/z int. rel.int.
  100 78 78
  101 8 8
  105 43 43
  106 20 20
  108 51 51
  110 16 16
  113 8 8
  115 20 20
  117 24 24
  118 39 39
  119 12 12
  120 20 20
  122 35 35
  123 20 20
  128 12 12
  129 27 27
  131 31 31
  132 16 16
  133 16 16
  134 35 35
  135 8 8
  136 8 8
  137 20 20
  138 8 8
  141 31 31
  142 8 8
  143 24 24
  144 39 39
  145 31 31
  146 63 63
  147 78 78
  148 51 51
  149 24 24
  150 8 8
  152 8 8
  153 67 67
  154 12 12
  155 43 43
  156 16 16
  157 55 55
  158 12 12
  159 31 31
  160 43 43
  161 215 215
  162 47 47
  165 27 27
  166 20 20
  167 63 63
  168 16 16
  169 47 47
  170 16 16
  171 31 31
  172 20 20
  173 110 110
  174 35 35
  175 24 24
  176 12 12
  177 16 16
  179 12 12
  180 47 47
  181 133 133
  182 63 63
  183 59 59
  184 114 114
  185 188 188
  186 24 24
  187 47 47
  188 12 12
  189 8 8
  190 12 12
  192 8 8
  193 12 12
  194 27 27
  195 43 43
  196 35 35
  197 71 71
  198 102 102
  199 172 172
  200 129 129
  201 47 47
  202 24 24
  203 16 16
  206 8 8
  207 35 35
  208 31 31
  209 43 43
  210 86 86
  211 125 125
  212 999 999
  213 337 337
  214 98 98
  215 31 31
  216 27 27
  220 8 8
  221 12 12
  222 24 24
  223 31 31
  224 55 55
  225 59 59
  226 317 317
  227 125 125
  228 313 313
  229 31 31
  234 12 12
  235 20 20
  236 27 27
  237 20 20
  238 55 55
  239 74 74
  240 129 129
  241 67 67
  242 59 59
  243 16 16
  244 8 8
  250 12 12
  251 8 8
  252 90 90
  253 31 31
  254 90 90
  255 24 24
  256 8 8
  264 8 8
  265 8 8
  266 20 20
  267 650 650
  268 149 149
  269 12 12
  270 270 270
  271 24 24
  280 8 8
  282 212 212
  283 24 24
  296 16 16
  306 27 27
  324 317 317
  325 59 59
  342 631 631
  343 90 90
  344 12 12
  360 24 24
  364 20 20
  378 12 12
  379 8 8
  380 114 114
  381 24 24
  382 8 8