ACCESSION: MSBNK-Waters-WA000768
RECORD_TITLE: Mitomycin C; LC-ESI-Q; MS; POS; 75 V
DATE: 2016.01.19 (Created 2007.08.01, modified 2011.05.06)
AUTHORS: Nihon Waters K.K.
LICENSE: CC BY-NC

CH$NAME: Mitomycin C
CH$COMPOUND_CLASS: N/A
CH$FORMULA: C15H18N4O5
CH$EXACT_MASS: 334.12772
CH$SMILES: NC(=O)OCC(c21)C(OC)(C43)N(CC(N4)3)c(c(=O)c(C)c(N)c(=O)2)1
CH$IUPAC: InChI=1S/C15H18N4O5/c1-5-9(16)12(21)8-6(4-24-14(17)22)15(23-2)13-7(18-13)3-19(15)10(8)11(5)20/h6-7,13,18H,3-4,16H2,1-2H3,(H2,17,22)/t6-,7+,13+,15-/m1/s1
CH$LINK: CAS 50-07-7
CH$LINK: INCHIKEY NWIBSHFKIJFRCO-WUDYKRTCSA-N
CH$LINK: COMPTOX DTXSID2020898

AC$INSTRUMENT: ZQ, Waters
AC$INSTRUMENT_TYPE: LC-ESI-Q
AC$MASS_SPECTROMETRY: MS_TYPE MS
AC$MASS_SPECTROMETRY: ION_MODE POSITIVE
AC$MASS_SPECTROMETRY: IONIZATION ESI
AC$CHROMATOGRAPHY: RETENTION_TIME 11.000 min
AC$CHROMATOGRAPHY: COLUMN_NAME 2.1 mm id - 3. 5{mu}m XTerra C18MS
AC$CHROMATOGRAPHY: COLUMN_TEMPERATURE 35 C
AC$CHROMATOGRAPHY: SAMPLING_CONE 75 V

MS$DATA_PROCESSING: FIND_PEAK ignore rel.int. < 5

PK$SPLASH: splash10-00lu-0940000000-c891d4d2fb6da609e81b
PK$NUM_PEAK: 110
PK$PEAK: m/z int. rel.int.
  103 27 27
  104 161 161
  105 71 71
  106 110 110
  107 27 27
  108 47 47
  109 12 12
  110 43 43
  115 78 78
  116 35 35
  117 82 82
  118 129 129
  119 51 51
  120 133 133
  121 24 24
  122 20 20
  124 8 8
  126 16 16
  128 24 24
  129 20 20
  130 90 90
  131 357 357
  132 462 462
  133 208 208
  134 106 106
  135 16 16
  136 12 12
  137 55 55
  138 8 8
  142 74 74
  143 51 51
  144 133 133
  145 94 94
  146 71 71
  147 47 47
  148 43 43
  149 71 71
  150 8 8
  154 20 20
  155 20 20
  156 86 86
  157 110 110
  158 71 71
  159 368 368
  160 106 106
  161 90 90
  162 47 47
  163 12 12
  168 43 43
  169 259 259
  170 141 141
  171 282 282
  172 98 98
  173 102 102
  174 59 59
  175 192 192
  176 98 98
  177 39 39
  178 12 12
  180 12 12
  181 16 16
  182 12 12
  183 8 8
  184 16 16
  185 125 125
  186 102 102
  187 153 153
  188 71 71
  189 71 71
  190 24 24
  191 20 20
  192 8 8
  196 20 20
  197 161 161
  198 133 133
  199 196 196
  200 90 90
  201 51 51
  202 176 176
  203 125 125
  204 55 55
  205 12 12
  206 27 27
  213 82 82
  214 255 255
  215 400 400
  216 102 102
  217 82 82
  218 20 20
  219 27 27
  225 39 39
  226 43 43
  227 74 74
  228 27 27
  229 55 55
  230 55 55
  231 43 43
  232 8 8
  240 8 8
  241 31 31
  242 999 999
  243 184 184
  244 63 63
  245 27 27
  274 20 20
  288 8 8
  335 125 125
  336 20 20
  357 8 8
  373 12 12