ACCESSION: MSBNK-Waters-WA000796
RECORD_TITLE: Imipramine; LC-ESI-Q; MS; POS; 60 V
DATE: 2016.01.19 (Created 2007.08.01, modified 2011.05.06)
AUTHORS: Nihon Waters K.K.
LICENSE: CC BY-NC

CH$NAME: Imipramine
CH$COMPOUND_CLASS: N/A
CH$FORMULA: C19H24N2
CH$EXACT_MASS: 280.19395
CH$SMILES: CN(C)CCCN(c21)c(c3)c(ccc3)CCc(cccc2)1
CH$IUPAC: InChI=1S/C19H24N2/c1-20(2)14-7-15-21-18-10-5-3-8-16(18)12-13-17-9-4-6-11-19(17)21/h3-6,8-11H,7,12-15H2,1-2H3
CH$LINK: CAS 50-49-7
CH$LINK: INCHIKEY BCGWQEUPMDMJNV-UHFFFAOYSA-N
CH$LINK: COMPTOX DTXSID1043881

AC$INSTRUMENT: ZQ, Waters
AC$INSTRUMENT_TYPE: LC-ESI-Q
AC$MASS_SPECTROMETRY: MS_TYPE MS
AC$MASS_SPECTROMETRY: ION_MODE POSITIVE
AC$MASS_SPECTROMETRY: IONIZATION ESI
AC$CHROMATOGRAPHY: RETENTION_TIME 14.600 min
AC$CHROMATOGRAPHY: COLUMN_NAME 2.1 mm id - 3. 5{mu}m XTerra C18MS
AC$CHROMATOGRAPHY: COLUMN_TEMPERATURE 35 C
AC$CHROMATOGRAPHY: SAMPLING_CONE 60 V

MS$DATA_PROCESSING: FIND_PEAK ignore rel.int. < 5

PK$SPLASH: splash10-0a4i-0290000000-13f1d015891e4ff79a80
PK$NUM_PEAK: 22
PK$PEAK: m/z int. rel.int.
  105 16 16
  118 8 8
  130 8 8
  132 8 8
  158 12 12
  180 8 8
  193 298 298
  194 51 51
  195 20 20
  196 12 12
  206 8 8
  208 999 999
  209 129 129
  210 12 12
  220 20 20
  221 8 8
  234 35 35
  235 16 16
  236 102 102
  237 16 16
  281 302 302
  282 55 55