ACCESSION: MSBNK-Waters-WA000811
RECORD_TITLE: Flurazepam; LC-ESI-Q; MS; POS; 90 V
DATE: 2016.01.19 (Created 2007.08.01, modified 2011.05.06)
AUTHORS: Nihon Waters K.K.
LICENSE: CC BY-NC

CH$NAME: Flurazepam
CH$COMPOUND_CLASS: N/A
CH$FORMULA: C21H23ClFN3O
CH$EXACT_MASS: 387.15137
CH$SMILES: CCN(CC)CCN(C(=O)2)c(c3)c(cc(Cl)c3)C(=NC2)c(c1)c(F)ccc1
CH$IUPAC: InChI=1S/C21H23ClFN3O/c1-3-25(4-2)11-12-26-19-10-9-15(22)13-17(19)21(24-14-20(26)27)16-7-5-6-8-18(16)23/h5-10,13H,3-4,11-12,14H2,1-2H3
CH$LINK: CAS 17617-23-1
CH$LINK: INCHIKEY SAADBVWGJQAEFS-UHFFFAOYSA-N
CH$LINK: COMPTOX DTXSID1023071

AC$INSTRUMENT: ZQ, Waters
AC$INSTRUMENT_TYPE: LC-ESI-Q
AC$MASS_SPECTROMETRY: MS_TYPE MS
AC$MASS_SPECTROMETRY: ION_MODE POSITIVE
AC$MASS_SPECTROMETRY: IONIZATION ESI
AC$CHROMATOGRAPHY: RETENTION_TIME 13.700 min
AC$CHROMATOGRAPHY: COLUMN_NAME 2.1 mm id - 3. 5{mu}m XTerra C18MS
AC$CHROMATOGRAPHY: COLUMN_TEMPERATURE 35 C
AC$CHROMATOGRAPHY: SAMPLING_CONE 90 V

MS$DATA_PROCESSING: FIND_PEAK ignore rel.int. < 5

PK$SPLASH: splash10-067i-0592000000-12cda2c05db23f9c57d7
PK$NUM_PEAK: 141
PK$PEAK: m/z int. rel.int.
  100 337 337
  101 16 16
  103 27 27
  107 12 12
  109 768 768
  110 35 35
  113 8 8
  115 31 31
  117 31 31
  118 8 8
  121 12 12
  122 24 24
  123 110 110
  125 157 157
  126 12 12
  127 51 51
  128 8 8
  130 239 239
  131 388 388
  132 27 27
  133 8 8
  134 415 415
  135 71 71
  136 16 16
  138 39 39
  139 16 16
  140 20 20
  143 12 12
  144 27 27
  150 176 176
  151 27 27
  152 74 74
  153 20 20
  154 20 20
  155 8 8
  156 12 12
  159 16 16
  162 86 86
  163 27 27
  164 118 118
  165 20 20
  166 168 168
  167 20 20
  168 39 39
  175 27 27
  176 8 8
  177 27 27
  178 16 16
  179 16 16
  180 24 24
  181 12 12
  183 114 114
  184 125 125
  185 16 16
  189 43 43
  191 118 118
  192 8 8
  193 55 55
  194 27 27
  195 8 8
  196 12 12
  197 8 8
  198 8 8
  204 20 20
  205 16 16
  206 12 12
  207 12 12
  208 12 12
  209 204 204
  210 35 35
  211 118 118
  212 12 12
  214 20 20
  216 63 63
  217 114 114
  218 20 20
  219 35 35
  222 55 55
  223 90 90
  224 306 306
  225 619 619
  226 59 59
  231 16 16
  232 27 27
  233 8 8
  234 8 8
  235 55 55
  236 325 325
  237 102 102
  238 31 31
  239 8 8
  240 20 20
  241 8 8
  242 8 8
  244 321 321
  245 188 188
  246 145 145
  247 67 67
  248 16 16
  251 94 94
  252 137 137
  253 172 172
  254 31 31
  255 8 8
  257 12 12
  258 294 294
  259 435 435
  260 357 357
  261 172 172
  262 78 78
  263 12 12
  265 16 16
  267 39 39
  268 8 8
  269 16 16
  270 16 16
  271 290 290
  272 286 286
  273 192 192
  274 102 102
  275 27 27
  279 16 16
  280 27 27
  285 133 133
  287 447 447
  288 141 141
  289 212 212
  290 55 55
  291 20 20
  295 31 31
  297 16 16
  312 16 16
  315 999 999
  316 153 153
  317 415 415
  318 63 63
  319 20 20
  388 227 227
  389 39 39
  390 90 90
  391 12 12