ACCESSION: MSBNK-Waters-WA001044
RECORD_TITLE: Lorazepam; LC-ESI-Q; MS; POS; 75 V
DATE: 2016.01.19 (Created 2007.08.01, modified 2011.05.06)
AUTHORS: Nihon Waters K.K.
LICENSE: CC BY-NC

CH$NAME: Lorazepam
CH$COMPOUND_CLASS: N/A
CH$FORMULA: C15H10Cl2N2O2
CH$EXACT_MASS: 320.01193
CH$SMILES: Clc(c3)cc(c(c3)2)C(=NC(O)C(=O)N2)c(c1)c(Cl)ccc1
CH$IUPAC: InChI=1S/C15H10Cl2N2O2/c16-8-5-6-12-10(7-8)13(19-15(21)14(20)18-12)9-3-1-2-4-11(9)17/h1-7,15,21H,(H,18,20)
CH$LINK: CAS 846-49-1
CH$LINK: INCHIKEY DIWRORZWFLOCLC-UHFFFAOYSA-N
CH$LINK: COMPTOX DTXSID7023225

AC$INSTRUMENT: ZQ, Waters
AC$INSTRUMENT_TYPE: LC-ESI-Q
AC$MASS_SPECTROMETRY: MS_TYPE MS
AC$MASS_SPECTROMETRY: ION_MODE POSITIVE
AC$MASS_SPECTROMETRY: IONIZATION ESI
AC$CHROMATOGRAPHY: RETENTION_TIME 15.200 min
AC$CHROMATOGRAPHY: COLUMN_NAME 2.1 mm id - 3. 5{mu}m XTerra C18MS
AC$CHROMATOGRAPHY: COLUMN_TEMPERATURE 35 C
AC$CHROMATOGRAPHY: SAMPLING_CONE 75 V

MS$DATA_PROCESSING: FIND_PEAK ignore rel.int. < 5

PK$SPLASH: splash10-004i-0692000000-d459fe4821eee8434400
PK$NUM_PEAK: 79
PK$PEAK: m/z int. rel.int.
  102 47 47
  111 8 8
  117 8 8
  118 51 51
  120 27 27
  126 12 12
  128 125 125
  130 145 145
  131 12 12
  138 419 419
  139 27 27
  140 141 141
  141 12 12
  143 20 20
  145 8 8
  153 67 67
  154 8 8
  155 24 24
  163 196 196
  164 24 24
  165 63 63
  166 31 31
  167 12 12
  168 8 8
  177 20 20
  179 31 31
  181 20 20
  193 12 12
  194 274 274
  195 47 47
  204 24 24
  205 35 35
  206 16 16
  213 16 16
  214 16 16
  229 999 999
  230 137 137
  231 353 353
  232 27 27
  239 51 51
  240 12 12
  241 43 43
  242 8 8
  243 8 8
  248 8 8
  250 8 8
  257 20 20
  259 8 8
  263 35 35
  265 35 35
  267 12 12
  273 8 8
  275 364 364
  276 43 43
  277 239 239
  278 27 27
  279 43 43
  280 8 8
  291 27 27
  293 20 20
  303 27 27
  305 20 20
  321 27 27
  323 20 20
  325 16 16
  327 8 8
  343 121 121
  344 12 12
  345 82 82
  347 20 20
  359 94 94
  360 8 8
  361 67 67
  362 8 8
  363 16 16
  365 8 8
  367 8 8
  384 16 16
  386 12 12