ACCESSION: MSBNK-Waters-WA001064
RECORD_TITLE: Metoclopramide; LC-ESI-Q; MS; POS; 90 V
DATE: 2016.01.19 (Created 2007.08.01, modified 2011.05.06)
AUTHORS: Nihon Waters K.K.
LICENSE: CC BY-NC

CH$NAME: Metoclopramide
CH$COMPOUND_CLASS: N/A
CH$FORMULA: C14H22ClN3O2
CH$EXACT_MASS: 299.14005
CH$SMILES: CCN(CC)CCNC(=O)c(c1)c(OC)cc(N)c(Cl)1
CH$IUPAC: InChI=1S/C14H22ClN3O2/c1-4-18(5-2)7-6-17-14(19)10-8-11(15)12(16)9-13(10)20-3/h8-9H,4-7,16H2,1-3H3,(H,17,19)
CH$LINK: CAS 364-62-5
CH$LINK: INCHIKEY TTWJBBZEZQICBI-UHFFFAOYSA-N
CH$LINK: COMPTOX DTXSID6045169

AC$INSTRUMENT: ZQ, Waters
AC$INSTRUMENT_TYPE: LC-ESI-Q
AC$MASS_SPECTROMETRY: MS_TYPE MS
AC$MASS_SPECTROMETRY: ION_MODE POSITIVE
AC$MASS_SPECTROMETRY: IONIZATION ESI
AC$CHROMATOGRAPHY: RETENTION_TIME 11.000 min
AC$CHROMATOGRAPHY: COLUMN_NAME 2.1 mm id - 3. 5{mu}m XTerra C18MS
AC$CHROMATOGRAPHY: COLUMN_TEMPERATURE 35 C
AC$CHROMATOGRAPHY: SAMPLING_CONE 90 V

MS$DATA_PROCESSING: FIND_PEAK ignore rel.int. < 5

PK$SPLASH: splash10-029x-0900000000-827cd87fe2a56453b202
PK$NUM_PEAK: 70
PK$PEAK: m/z int. rel.int.
  101 67 67
  104 20 20
  105 114 114
  106 39 39
  107 47 47
  108 121 121
  109 8 8
  111 16 16
  113 999 999
  114 78 78
  115 333 333
  116 24 24
  118 16 16
  119 47 47
  120 121 121
  121 24 24
  122 8 8
  124 8 8
  126 223 223
  127 51 51
  128 212 212
  129 74 74
  130 39 39
  131 133 133
  132 12 12
  133 16 16
  134 16 16
  139 12 12
  140 31 31
  141 964 964
  142 90 90
  143 313 313
  144 78 78
  146 16 16
  147 24 24
  148 102 102
  149 24 24
  150 27 27
  154 384 384
  155 39 39
  156 278 278
  157 20 20
  158 35 35
  162 8 8
  167 35 35
  168 404 404
  169 212 212
  170 223 223
  171 67 67
  172 43 43
  181 24 24
  182 27 27
  183 106 106
  184 674 674
  185 82 82
  186 196 196
  187 78 78
  189 16 16
  211 16 16
  212 106 106
  213 12 12
  214 31 31
  227 153 153
  228 12 12
  229 47 47
  266 8 8
  300 145 145
  301 24 24
  302 43 43
  303 8 8