ACCESSION: MSBNK-Waters-WA001069
RECORD_TITLE: Metoclopramide; LC-ESI-Q; MS; POS; 15 V
DATE: 2016.01.19 (Created 2007.08.01, modified 2011.05.06)
AUTHORS: Nihon Waters K.K.
LICENSE: CC BY-NC

CH$NAME: Metoclopramide
CH$COMPOUND_CLASS: N/A
CH$FORMULA: C14H22ClN3O2
CH$EXACT_MASS: 299.14005
CH$SMILES: CCN(CC)CCNC(=O)c(c1)c(OC)cc(N)c(Cl)1
CH$IUPAC: InChI=1S/C14H22ClN3O2/c1-4-18(5-2)7-6-17-14(19)10-8-11(15)12(16)9-13(10)20-3/h8-9H,4-7,16H2,1-3H3,(H,17,19)
CH$LINK: CAS 364-62-5
CH$LINK: INCHIKEY TTWJBBZEZQICBI-UHFFFAOYSA-N
CH$LINK: COMPTOX DTXSID6045169

AC$INSTRUMENT: ZQ, Waters
AC$INSTRUMENT_TYPE: LC-ESI-Q
AC$MASS_SPECTROMETRY: MS_TYPE MS
AC$MASS_SPECTROMETRY: ION_MODE POSITIVE
AC$MASS_SPECTROMETRY: IONIZATION ESI
AC$CHROMATOGRAPHY: RETENTION_TIME 11.000 min
AC$CHROMATOGRAPHY: COLUMN_NAME 2.1 mm id - 3. 5{mu}m XTerra C18MS
AC$CHROMATOGRAPHY: COLUMN_TEMPERATURE 35 C
AC$CHROMATOGRAPHY: SAMPLING_CONE 15 V

MS$DATA_PROCESSING: FIND_PEAK ignore rel.int. < 5

PK$SPLASH: splash10-0udi-0009000000-88d863038c3b97bd00a3
PK$NUM_PEAK: 8
PK$PEAK: m/z int. rel.int.
  227 27 27
  229 8 8
  266 59 59
  267 8 8
  300 999 999
  301 157 157
  302 341 341
  303 47 47