ACCESSION: MSBNK-Waters-WA001106
RECORD_TITLE: Paroxetine; LC-ESI-Q; MS; POS; 75 V
DATE: 2016.01.19 (Created 2007.08.01, modified 2011.05.06)
AUTHORS: Nihon Waters K.K.
LICENSE: CC BY-NC

CH$NAME: Paroxetine
CH$COMPOUND_CLASS: N/A
CH$FORMULA: C19H20FNO3
CH$EXACT_MASS: 329.14272
CH$SMILES: Fc(c4)ccc(c4)C(C3)C(CNC3)COc(c1)cc(O2)c(OC2)c1
CH$IUPAC: InChI=1S/C19H20FNO3/c20-15-3-1-13(2-4-15)17-7-8-21-10-14(17)11-22-16-5-6-18-19(9-16)24-12-23-18/h1-6,9,14,17,21H,7-8,10-12H2/t14-,17-/m0/s1
CH$LINK: CAS 61869-08-7
CH$LINK: INCHIKEY AHOUBRCZNHFOSL-YOEHRIQHSA-N
CH$LINK: COMPTOX DTXSID3023425

AC$INSTRUMENT: ZQ, Waters
AC$INSTRUMENT_TYPE: LC-ESI-Q
AC$MASS_SPECTROMETRY: MS_TYPE MS
AC$MASS_SPECTROMETRY: ION_MODE POSITIVE
AC$MASS_SPECTROMETRY: IONIZATION ESI
AC$CHROMATOGRAPHY: RETENTION_TIME 13.800 min
AC$CHROMATOGRAPHY: COLUMN_NAME 2.1 mm id - 3. 5{mu}m XTerra C18MS
AC$CHROMATOGRAPHY: COLUMN_TEMPERATURE 35 C
AC$CHROMATOGRAPHY: SAMPLING_CONE 75 V

MS$DATA_PROCESSING: FIND_PEAK ignore rel.int. < 5

PK$SPLASH: splash10-059i-0900000000-443a657bed72bb7964df
PK$NUM_PEAK: 64
PK$PEAK: m/z int. rel.int.
  100 8 8
  103 118 118
  104 8 8
  105 35 35
  109 999 999
  110 78 78
  111 51 51
  115 141 141
  116 31 31
  117 16 16
  119 20 20
  121 82 82
  123 670 670
  124 51 51
  128 43 43
  129 24 24
  133 63 63
  134 27 27
  135 913 913
  136 161 161
  137 27 27
  138 39 39
  139 31 31
  140 8 8
  142 12 12
  143 39 39
  144 20 20
  145 8 8
  146 27 27
  147 129 129
  148 153 153
  149 67 67
  150 94 94
  151 357 357
  152 20 20
  158 8 8
  159 12 12
  160 12 12
  161 106 106
  162 12 12
  163 329 329
  164 59 59
  171 12 12
  172 8 8
  175 24 24
  176 24 24
  178 39 39
  186 27 27
  187 8 8
  190 8 8
  192 313 313
  193 35 35
  199 8 8
  201 12 12
  206 8 8
  210 12 12
  234 102 102
  235 31 31
  248 8 8
  249 12 12
  250 8 8
  330 219 219
  331 43 43
  332 8 8