ACCESSION: MSBNK-Waters-WA001123
RECORD_TITLE: Pholcodine; LC-ESI-Q; MS; POS; 15 V, 30 V
DATE: 2016.01.19 (Created 2007.08.01, modified 2011.05.06)
AUTHORS: Nihon Waters K.K.
LICENSE: CC BY-NC

CH$NAME: Pholcodine
CH$COMPOUND_CLASS: N/A
CH$FORMULA: C23H30N2O4
CH$EXACT_MASS: 398.22056
CH$SMILES: O(C6)CCN(C6)CCOc(c5)c(O4)c(c(c5)1)C(C2)(C34)C([H])(C=CC(O)3)C(N(C)C2)C1
CH$IUPAC: InChI=1S/C23H30N2O4/c1-24-7-6-23-16-3-4-18(26)22(23)29-21-19(5-2-15(20(21)23)14-17(16)24)28-13-10-25-8-11-27-12-9-25/h2-5,16-18,22,26H,6-14H2,1H3/t16-,17+,18-,22-,23-/m0/s1
CH$LINK: CAS 509-67-1
CH$LINK: INCHIKEY GPFAJKDEDBRFOS-FKQDBXSBSA-N
CH$LINK: COMPTOX DTXSID70198923

AC$INSTRUMENT: ZQ, Waters
AC$INSTRUMENT_TYPE: LC-ESI-Q
AC$MASS_SPECTROMETRY: MS_TYPE MS
AC$MASS_SPECTROMETRY: ION_MODE POSITIVE
AC$MASS_SPECTROMETRY: IONIZATION ESI
AC$CHROMATOGRAPHY: RETENTION_TIME 2.600 min
AC$CHROMATOGRAPHY: COLUMN_NAME 2.1 mm id - 3. 5{mu}m XTerra C18MS
AC$CHROMATOGRAPHY: COLUMN_TEMPERATURE 35 C
AC$CHROMATOGRAPHY: SAMPLING_CONE 15 V, 30 V

MS$DATA_PROCESSING: FIND_PEAK ignore rel.int. < 5

PK$SPLASH: splash10-0f6t-0169200000-86ed4029b081703ed750
PK$NUM_PEAK: 14
PK$PEAK: m/z int. rel.int.
  130 71 71
  132 12 12
  162 35 35
  163 8 8
  195 8 8
  200 372 372
  221 302 302
  239 8 8
  397 12 12
  399 999 999
  400 215 215
  401 20 20
  415 8 8
  417 8 8