ACCESSION: MSBNK-Waters-WA001141
RECORD_TITLE: Chlorthalidone; LC-ESI-Q; MS; POS; 90 V
DATE: 2016.01.19 (Created 2007.08.01, modified 2011.05.06)
AUTHORS: Nihon Waters K.K.
LICENSE: CC BY-NC

CH$NAME: Chlorthalidone
CH$COMPOUND_CLASS: N/A
CH$FORMULA: C14H11ClN2O4S
CH$EXACT_MASS: 338.01281
CH$SMILES: O=C(N1)c(c3)c(ccc3)C(O)1c(c2)cc(c(Cl)c2)S(N)(=O)=O
CH$IUPAC: InChI=1S/C14H11ClN2O4S/c15-11-6-5-8(7-12(11)22(16,20)21)14(19)10-4-2-1-3-9(10)13(18)17-14/h1-7,19H,(H,17,18)(H2,16,20,21)
CH$LINK: CAS 77-36-1
CH$LINK: INCHIKEY JIVPVXMEBJLZRO-UHFFFAOYSA-N
CH$LINK: COMPTOX DTXSID4022812

AC$INSTRUMENT: ZQ, Waters
AC$INSTRUMENT_TYPE: LC-ESI-Q
AC$MASS_SPECTROMETRY: MS_TYPE MS
AC$MASS_SPECTROMETRY: ION_MODE POSITIVE
AC$MASS_SPECTROMETRY: IONIZATION ESI
AC$CHROMATOGRAPHY: RETENTION_TIME 12.900 min
AC$CHROMATOGRAPHY: COLUMN_NAME 2.1 mm id - 3. 5{mu}m XTerra C18MS
AC$CHROMATOGRAPHY: COLUMN_TEMPERATURE 35 C
AC$CHROMATOGRAPHY: SAMPLING_CONE 90 V

MS$DATA_PROCESSING: FIND_PEAK ignore rel.int. < 5

PK$SPLASH: splash10-002o-0893000000-74d79b79e7187f79d133
PK$NUM_PEAK: 126
PK$PEAK: m/z int. rel.int.
  105 165 165
  108 55 55
  113 8 8
  115 12 12
  118 20 20
  119 16 16
  120 12 12
  121 8 8
  123 16 16
  126 24 24
  130 204 204
  131 55 55
  136 8 8
  139 172 172
  140 35 35
  141 12 12
  144 43 43
  148 114 114
  149 24 24
  150 349 349
  151 157 157
  152 505 505
  153 47 47
  155 16 16
  156 16 16
  157 8 8
  161 8 8
  162 31 31
  164 8 8
  166 8 8
  167 149 149
  168 78 78
  169 47 47
  175 16 16
  176 27 27
  177 548 548
  178 86 86
  179 114 114
  180 98 98
  181 12 12
  182 12 12
  185 580 580
  186 392 392
  187 262 262
  188 118 118
  190 31 31
  191 39 39
  192 129 129
  193 20 20
  194 43 43
  195 86 86
  196 47 47
  197 55 55
  198 12 12
  201 8 8
  203 157 157
  204 20 20
  205 71 71
  206 118 118
  207 153 153
  208 31 31
  212 82 82
  213 235 235
  214 313 313
  215 133 133
  216 71 71
  217 51 51
  218 39 39
  220 20 20
  221 35 35
  222 16 16
  223 121 121
  224 20 20
  226 576 576
  227 35 35
  228 219 219
  229 12 12
  230 43 43
  231 196 196
  232 31 31
  233 55 55
  234 12 12
  240 321 321
  241 595 595
  242 137 137
  243 999 999
  244 71 71
  245 259 259
  246 12 12
  253 20 20
  254 35 35
  255 24 24
  256 16 16
  258 20 20
  259 82 82
  260 24 24
  261 31 31
  269 8 8
  273 20 20
  275 8 8
  276 12 12
  281 8 8
  284 16 16
  288 8 8
  304 71 71
  305 47 47
  306 51 51
  307 24 24
  321 298 298
  322 556 556
  323 204 204
  324 227 227
  325 8 8
  339 12 12
  341 8 8
  356 82 82
  358 27 27
  359 8 8
  360 8 8
  361 67 67
  362 8 8
  363 24 24
  377 180 180
  378 8 8
  379 133 133
  380 12 12