ACCESSION: MSBNK-Waters-WA001170
RECORD_TITLE: Amprenavir; LC-ESI-Q; MS; POS; 60 V
DATE: 2016.01.19 (Created 2007.08.01, modified 2011.10.25)
AUTHORS: Nihon Waters K.K.
LICENSE: CC BY-NC

CH$NAME: Amprenavir
CH$COMPOUND_CLASS: N/A
CH$FORMULA: C25H35N3O6S
CH$EXACT_MASS: 505.22466
CH$SMILES: CC(C)CN(CC(O)C(NC(=O)OC(C3)COC3)Cc(c2)cccc2)S(=O)(=O)c(c1)ccc(N)c1
CH$IUPAC: InChI=1S/C25H35N3O6S/c1-18(2)15-28(35(31,32)22-10-8-20(26)9-11-22)16-24(29)23(14-19-6-4-3-5-7-19)27-25(30)34-21-12-13-33-17-21/h3-11,18,21,23-24,29H,12-17,26H2,1-2H3,(H,27,30)/t21-,23-,24+/m0/s1
CH$LINK: CAS 161814-49-9
CH$LINK: INCHIKEY YMARZQAQMVYCKC-OEMFJLHTSA-N

AC$INSTRUMENT: ZQ, Waters
AC$INSTRUMENT_TYPE: LC-ESI-Q
AC$MASS_SPECTROMETRY: MS_TYPE MS
AC$MASS_SPECTROMETRY: ION_MODE POSITIVE
AC$MASS_SPECTROMETRY: IONIZATION ESI
AC$CHROMATOGRAPHY: RETENTION_TIME 16.600 min
AC$CHROMATOGRAPHY: COLUMN_NAME 2.1 mm id - 3. 5{mu}m XTerra C18MS
AC$CHROMATOGRAPHY: COLUMN_TEMPERATURE 35 C
AC$CHROMATOGRAPHY: SAMPLING_CONE 60 V

MS$FOCUSED_ION: PRECURSOR_TYPE [M+H]+
MS$DATA_PROCESSING: FIND_PEAK ignore rel.int. < 5

PK$SPLASH: splash10-0k92-0983120000-d7589a71bf73f990c6ac
PK$ANNOTATION: m/z type
  528 [M+Na]+
  544 [M+K]+
PK$NUM_PEAK: 90
PK$PEAK: m/z int. rel.int.
  100 55 55
  103 12 12
  105 8 8
  108 137 137
  109 12 12
  113 31 31
  115 39 39
  116 20 20
  118 12 12
  120 329 329
  127 16 16
  129 274 274
  130 20 20
  131 67 67
  133 20 20
  134 67 67
  135 8 8
  141 8 8
  144 12 12
  146 247 247
  147 24 24
  150 20 20
  156 999 999
  157 67 67
  158 8 8
  163 8 8
  164 110 110
  165 12 12
  172 47 47
  176 47 47
  177 8 8
  187 8 8
  188 8 8
  189 110 110
  190 20 20
  199 12 12
  200 63 63
  202 345 345
  203 31 31
  205 8 8
  207 12 12
  208 345 345
  209 20 20
  215 12 12
  217 20 20
  218 24 24
  219 12 12
  220 20 20
  230 27 27
  234 12 12
  237 74 74
  238 8 8
  241 204 204
  245 928 928
  246 90 90
  249 24 24
  255 20 20
  259 8 8
  261 176 176
  262 12 12
  263 259 259
  264 31 31
  278 16 16
  281 31 31
  295 39 39
  296 8 8
  333 12 12
  349 533 533
  350 71 71
  351 454 454
  352 55 55
  357 12 12
  362 8 8
  374 16 16
  392 90 90
  393 16 16
  394 8 8
  418 286 286
  419 71 71
  420 16 16
  506 188 188
  507 39 39
  508 16 16
  523 8 8
  528 125 125
  529 27 27
  530 8 8
  544 188 188
  545 27 27
  546 24 24