ACCESSION: MSBNK-Waters-WA001283
RECORD_TITLE: Fluoxetine; LC-ESI-Q; MS; POS; 45 V
DATE: 2016.01.19 (Created 2007.08.01, modified 2011.05.06)
AUTHORS: Nihon Waters K.K.
LICENSE: CC BY-NC

CH$NAME: Fluoxetine
CH$COMPOUND_CLASS: N/A
CH$FORMULA: C17H18F3NO
CH$EXACT_MASS: 309.13405
CH$SMILES: CNCCC(Oc(c2)ccc(c2)C(F)(F)F)c(c1)cccc1
CH$IUPAC: InChI=1S/C17H18F3NO/c1-21-12-11-16(13-5-3-2-4-6-13)22-15-9-7-14(8-10-15)17(18,19)20/h2-10,16,21H,11-12H2,1H3
CH$LINK: CAS 54910-89-3
CH$LINK: INCHIKEY RTHCYVBBDHJXIQ-UHFFFAOYSA-N
CH$LINK: COMPTOX DTXSID7023067

AC$INSTRUMENT: ZQ, Waters
AC$INSTRUMENT_TYPE: LC-ESI-Q
AC$MASS_SPECTROMETRY: MS_TYPE MS
AC$MASS_SPECTROMETRY: ION_MODE POSITIVE
AC$MASS_SPECTROMETRY: IONIZATION ESI
AC$CHROMATOGRAPHY: RETENTION_TIME 15.100 min
AC$CHROMATOGRAPHY: COLUMN_NAME 2.1 mm id - 3. 5{mu}m XTerra C18MS
AC$CHROMATOGRAPHY: COLUMN_TEMPERATURE 35 C
AC$CHROMATOGRAPHY: SAMPLING_CONE 45 V

MS$DATA_PROCESSING: FIND_PEAK ignore rel.int. < 5

PK$SPLASH: splash10-014i-0933000000-03d4b3c0f838a4ec0a95
PK$NUM_PEAK: 45
PK$PEAK: m/z int. rel.int.
  101 27 27
  105 67 67
  115 889 889
  116 78 78
  117 999 999
  118 59 59
  127 8 8
  133 24 24
  140 8 8
  144 12 12
  148 137 137
  149 8 8
  156 8 8
  157 16 16
  164 67 67
  166 16 16
  176 8 8
  177 8 8
  184 12 12
  189 59 59
  191 8 8
  195 8 8
  197 8 8
  201 59 59
  210 12 12
  219 8 8
  223 8 8
  230 35 35
  231 27 27
  239 8 8
  251 59 59
  252 8 8
  259 627 627
  260 74 74
  261 12 12
  265 51 51
  266 20 20
  279 8 8
  290 78 78
  291 16 16
  310 737 737
  311 106 106
  312 16 16
  351 8 8
  373 8 8