ACCESSION: MSBNK-Waters-WA001307
RECORD_TITLE: Clobazam; LC-ESI-Q; MS; POS; 15 V
DATE: 2016.01.19 (Created 2007.08.01, modified 2011.05.06)
AUTHORS: Nihon Waters K.K.
LICENSE: CC BY-NC

CH$NAME: Clobazam
CH$COMPOUND_CLASS: N/A
CH$FORMULA: C16H13ClN2O2
CH$EXACT_MASS: 300.06656
CH$SMILES: Clc(c3)cc(c(c3)2)N(C(=O)CC(=O)N(C)2)c(c1)cccc1
CH$IUPAC: InChI=1S/C16H13ClN2O2/c1-18-13-8-7-11(17)9-14(13)19(16(21)10-15(18)20)12-5-3-2-4-6-12/h2-9H,10H2,1H3
CH$LINK: CAS 22316-47-8
CH$LINK: INCHIKEY CXOXHMZGEKVPMT-UHFFFAOYSA-N
CH$LINK: COMPTOX DTXSID2046759

AC$INSTRUMENT: ZQ, Waters
AC$INSTRUMENT_TYPE: LC-ESI-Q
AC$MASS_SPECTROMETRY: MS_TYPE MS
AC$MASS_SPECTROMETRY: ION_MODE POSITIVE
AC$MASS_SPECTROMETRY: IONIZATION ESI
AC$CHROMATOGRAPHY: RETENTION_TIME 16.400 min
AC$CHROMATOGRAPHY: COLUMN_NAME 2.1 mm id - 3. 5{mu}m XTerra C18MS
AC$CHROMATOGRAPHY: COLUMN_TEMPERATURE 35 C
AC$CHROMATOGRAPHY: SAMPLING_CONE 15 V

MS$DATA_PROCESSING: FIND_PEAK ignore rel.int. < 5

PK$SPLASH: splash10-0udi-0009000000-7542172cc229feeb5003
PK$NUM_PEAK: 23
PK$PEAK: m/z int. rel.int.
  301 999 999
  302 137 137
  303 353 353
  304 47 47
  318 298 298
  319 43 43
  320 110 110
  321 16 16
  323 55 55
  325 20 20
  339 55 55
  340 8 8
  341 24 24
  342 27 27
  346 8 8
  364 8 8
  601 24 24
  602 8 8
  603 16 16
  618 16 16
  620 12 12
  623 20 20
  625 12 12