ACCESSION: MSBNK-Waters-WA001344
RECORD_TITLE: Theophylline; LC-ESI-Q; MS; POS; 15 V
DATE: 2016.01.19 (Created 2007.08.01, modified 2011.05.06)
AUTHORS: Nihon Waters K.K.
LICENSE: CC BY-NC

CH$NAME: Theophylline
CH$COMPOUND_CLASS: N/A
CH$FORMULA: C7H8N4O2
CH$EXACT_MASS: 180.06473
CH$SMILES: CN1C2=C(C(=O)N(C1=O)C)NC=N2
CH$IUPAC: InChI=1S/C7H8N4O2/c1-10-5-4(8-3-9-5)6(12)11(2)7(10)13/h3H,1-2H3,(H,8,9)
CH$LINK: CAS 58-55-9
CH$LINK: INCHIKEY ZFXYFBGIUFBOJW-UHFFFAOYSA-N
CH$LINK: COMPTOX DTXSID5021336

AC$INSTRUMENT: ZQ, Waters
AC$INSTRUMENT_TYPE: LC-ESI-Q
AC$MASS_SPECTROMETRY: MS_TYPE MS
AC$MASS_SPECTROMETRY: ION_MODE POSITIVE
AC$MASS_SPECTROMETRY: IONIZATION ESI
AC$CHROMATOGRAPHY: RETENTION_TIME 10.050 min
AC$CHROMATOGRAPHY: COLUMN_NAME 2.1 mm id - 3. 5{mu}m XTerra C18MS
AC$CHROMATOGRAPHY: COLUMN_TEMPERATURE 35 C
AC$CHROMATOGRAPHY: SAMPLING_CONE 15 V

MS$DATA_PROCESSING: FIND_PEAK ignore rel.int. < 5

PK$SPLASH: splash10-001i-0920000000-e2dcd7b6e899dada93f3
PK$NUM_PEAK: 31
PK$PEAK: m/z int. rel.int.
  104 35 35
  114 27 27
  117 20 20
  121 8 8
  122 31 31
  131 8 8
  132 12 12
  135 24 24
  141 27 27
  142 35 35
  146 12 12
  147 8 8
  152 8 8
  157 8 8
  158 8 8
  165 16 16
  167 16 16
  168 8 8
  178 20 20
  181 999 999
  182 63 63
  194 8 8
  196 8 8
  198 8 8
  203 90 90
  205 16 16
  206 16 16
  219 255 255
  220 20 20
  221 16 16
  224 8 8