ACCESSION: MSBNK-Waters-WA001418
RECORD_TITLE: Losartan; LC-ESI-Q; MS; POS; 90 V
DATE: 2016.01.19 (Created 2007.08.01, modified 2011.05.06)
AUTHORS: Nihon Waters K.K.
LICENSE: CC BY-NC

CH$NAME: Losartan
CH$COMPOUND_CLASS: N/A
CH$FORMULA: C22H23ClN6O
CH$EXACT_MASS: 422.16219
CH$SMILES: CCCCC1=NC(=C(N1CC2=CC=C(C=C2)C3=CC=CC=C3C4=NNN=N4)CO)Cl
CH$IUPAC: InChI=1S/C22H23ClN6O/c1-2-3-8-20-24-21(23)19(14-30)29(20)13-15-9-11-16(12-10-15)17-6-4-5-7-18(17)22-25-27-28-26-22/h4-7,9-12,30H,2-3,8,13-14H2,1H3,(H,25,26,27,28)
CH$LINK: CAS 114798-26-4
CH$LINK: INCHIKEY PSIFNNKUMBGKDQ-UHFFFAOYSA-N
CH$LINK: COMPTOX DTXSID7023227

AC$INSTRUMENT: ZQ, Waters
AC$INSTRUMENT_TYPE: LC-ESI-Q
AC$MASS_SPECTROMETRY: MS_TYPE MS
AC$MASS_SPECTROMETRY: ION_MODE POSITIVE
AC$MASS_SPECTROMETRY: IONIZATION ESI
AC$CHROMATOGRAPHY: RETENTION_TIME 15.680 min
AC$CHROMATOGRAPHY: COLUMN_NAME 2.1 mm id - 3. 5{mu}m XTerra C18MS
AC$CHROMATOGRAPHY: COLUMN_TEMPERATURE 35 C
AC$CHROMATOGRAPHY: SAMPLING_CONE 90 V

MS$DATA_PROCESSING: FIND_PEAK ignore rel.int. < 5

PK$SPLASH: splash10-102c-0920000000-4ad55695e6f922c7f89e
PK$NUM_PEAK: 92
PK$PEAK: m/z int. rel.int.
  102 43 43
  104 24 24
  105 20 20
  107 8 8
  108 39 39
  114 8 8
  115 71 71
  116 12 12
  117 31 31
  118 157 157
  119 12 12
  127 35 35
  128 51 51
  129 82 82
  130 43 43
  131 8 8
  135 16 16
  138 12 12
  139 86 86
  140 153 153
  141 35 35
  142 125 125
  143 12 12
  144 39 39
  145 20 20
  146 8 8
  150 20 20
  151 133 133
  152 999 999
  153 498 498
  154 102 102
  155 47 47
  163 172 172
  164 208 208
  165 815 815
  166 200 200
  167 102 102
  168 67 67
  169 114 114
  170 24 24
  171 39 39
  173 12 12
  176 16 16
  177 200 200
  178 400 400
  179 505 505
  180 705 705
  181 157 157
  182 12 12
  183 8 8
  188 8 8
  189 27 27
  190 580 580
  191 223 223
  192 768 768
  193 110 110
  194 20 20
  195 12 12
  196 47 47
  204 8 8
  205 999 999
  206 419 419
  207 364 364
  208 51 51
  209 8 8
  214 16 16
  216 8 8
  217 16 16
  219 31 31
  220 20 20
  229 8 8
  230 12 12
  231 16 16
  232 8 8
  233 27 27
  241 8 8
  243 8 8
  258 8 8
  405 31 31
  406 8 8
  407 8 8
  423 192 192
  424 47 47
  425 74 74
  426 16 16
  445 59 59
  446 12 12
  447 16 16
  461 102 102
  462 24 24
  463 27 27
  464 12 12