ACCESSION: MSBNK-Waters-WA001638
RECORD_TITLE: Etidocaine; LC-ESI-Q; MS; POS; 15 V
DATE: 2016.01.19 (Created 2007.08.01, modified 2011.05.06)
AUTHORS: Nihon Waters K.K.
LICENSE: CC BY-NC

CH$NAME: Etidocaine
CH$COMPOUND_CLASS: N/A
CH$FORMULA: C17H28N2O
CH$EXACT_MASS: 276.22016
CH$SMILES: CCCN(CC)C(CC)C(=O)Nc(c(C)1)c(C)ccc1
CH$IUPAC: InChI=1S/C17H28N2O/c1-6-12-19(8-3)15(7-2)17(20)18-16-13(4)10-9-11-14(16)5/h9-11,15H,6-8,12H2,1-5H3,(H,18,20)
CH$LINK: CAS 36637-18-0
CH$LINK: INCHIKEY VTUSIVBDOCDNHS-UHFFFAOYSA-N
CH$LINK: COMPTOX DTXSID1023027

AC$INSTRUMENT: ZQ, Waters
AC$INSTRUMENT_TYPE: LC-ESI-Q
AC$MASS_SPECTROMETRY: MS_TYPE MS
AC$MASS_SPECTROMETRY: ION_MODE POSITIVE
AC$MASS_SPECTROMETRY: IONIZATION ESI
AC$CHROMATOGRAPHY: RETENTION_TIME 12.870 min
AC$CHROMATOGRAPHY: COLUMN_NAME 2.1 mm id - 3. 5{mu}m XTerra C18MS
AC$CHROMATOGRAPHY: COLUMN_TEMPERATURE 35 C
AC$CHROMATOGRAPHY: SAMPLING_CONE 15 V

MS$DATA_PROCESSING: FIND_PEAK ignore rel.int. < 5

PK$SPLASH: splash10-004i-0090000000-77da7dc8c34881fe6d38
PK$NUM_PEAK: 5
PK$PEAK: m/z int. rel.int.
  128 24 24
  163 8 8
  277 999 999
  278 172 172
  279 16 16