ACCESSION: MSBNK-Waters-WA001767
RECORD_TITLE: Meclofenamic acid; LC-ESI-Q; MS; NEG; 30 V
DATE: 2016.01.19 (Created 2007.08.01, modified 2011.05.06)
AUTHORS: Nihon Waters K.K.
LICENSE: CC BY-NC

CH$NAME: Meclofenamic acid
CH$COMPOUND_CLASS: N/A
CH$FORMULA: C14H11Cl2NO2
CH$EXACT_MASS: 295.01668
CH$SMILES: OC(=O)c(c2)c(ccc2)Nc(c(Cl)1)c(Cl)c(C)cc1
CH$IUPAC: InChI=1S/C14H11Cl2NO2/c1-8-6-7-10(15)13(12(8)16)17-11-5-3-2-4-9(11)14(18)19/h2-7,17H,1H3,(H,18,19)
CH$LINK: CAS 644-62-2
CH$LINK: INCHIKEY SBDNJUWAMKYJOX-UHFFFAOYSA-N
CH$LINK: COMPTOX DTXSID0048559

AC$INSTRUMENT: ZQ, Waters
AC$INSTRUMENT_TYPE: LC-ESI-Q
AC$MASS_SPECTROMETRY: MS_TYPE MS
AC$MASS_SPECTROMETRY: ION_MODE NEGATIVE
AC$MASS_SPECTROMETRY: IONIZATION ESI
AC$CHROMATOGRAPHY: RETENTION_TIME 19.200 min
AC$CHROMATOGRAPHY: COLUMN_NAME 2.1 mm id - 3. 5{mu}m XTerra C18MS
AC$CHROMATOGRAPHY: COLUMN_TEMPERATURE 35 C
AC$CHROMATOGRAPHY: SAMPLING_CONE 30 V

MS$DATA_PROCESSING: FIND_PEAK ignore rel.int. < 5

PK$SPLASH: splash10-0007-0090000000-e8025c5598df16f7d9f3
PK$NUM_PEAK: 31
PK$PEAK: m/z int. rel.int.
  113 8 8
  117 8 8
  162 8 8
  172 8 8
  214 47 47
  215 8 8
  216 12 12
  220 12 12
  221 8 8
  232 24 24
  258 235 235
  259 35 35
  260 74 74
  265 51 51
  266 8 8
  274 20 20
  294 999 999
  295 188 188
  296 639 639
  297 78 78
  298 90 90
  299 12 12
  313 8 8
  319 12 12
  337 12 12
  368 71 71
  370 82 82
  372 20 20
  374 8 8
  378 8 8
  380 55 55