ACCESSION: MSBNK-Waters-WA001780
RECORD_TITLE: Bromocriptine; LC-ESI-Q; MS; POS; 75 V
DATE: 2016.01.19 (Created 2007.08.01, modified 2011.05.06)
AUTHORS: Nihon Waters K.K.
LICENSE: CC BY-NC

CH$NAME: Bromocriptine
CH$COMPOUND_CLASS: N/A
CH$FORMULA: C32H40BrN5O5
CH$EXACT_MASS: 653.22128
CH$SMILES: CC(C)C[C@H]1C(=O)N2CCC[C@H]2[C@]3(N1C(=O)[C@](O3)(C(C)C)NC(=O)[C@H]4CN([C@@H]5CC6=C(NC7=CC=CC(=C67)C5=C4)Br)C)O
CH$IUPAC: InChI=1S/C32H40BrN5O5/c1-16(2)12-24-29(40)37-11-7-10-25(37)32(42)38(24)30(41)31(43-32,17(3)4)35-28(39)18-13-20-19-8-6-9-22-26(19)21(27(33)34-22)14-23(20)36(5)15-18/h6,8-9,13,16-18,23-25,34,42H,7,10-12,14-15H2,1-5H3,(H,35,39)/t18-,23-,24+,25+,31-,32+/m1/s1
CH$LINK: CAS 25614-03-3
CH$LINK: INCHIKEY OZVBMTJYIDMWIL-AYFBDAFISA-N
CH$LINK: COMPTOX DTXSID1022687

AC$INSTRUMENT: ZQ, Waters
AC$INSTRUMENT_TYPE: LC-ESI-Q
AC$MASS_SPECTROMETRY: MS_TYPE MS
AC$MASS_SPECTROMETRY: ION_MODE POSITIVE
AC$MASS_SPECTROMETRY: IONIZATION ESI
AC$CHROMATOGRAPHY: RETENTION_TIME 15.020 min
AC$CHROMATOGRAPHY: COLUMN_NAME 2.1 mm id - 3. 5{mu}m XTerra C18MS
AC$CHROMATOGRAPHY: COLUMN_TEMPERATURE 35 C
AC$CHROMATOGRAPHY: SAMPLING_CONE 75 V

MS$DATA_PROCESSING: FIND_PEAK ignore rel.int. < 5

PK$SPLASH: splash10-0zfr-0069001000-33434e6496e66d5a4b5a
PK$NUM_PEAK: 104
PK$PEAK: m/z int. rel.int.
  115 12 12
  116 12 12
  152 27 27
  153 16 16
  179 8 8
  181 102 102
  182 8 8
  183 8 8
  190 8 8
  191 27 27
  192 8 8
  193 16 16
  206 94 94
  207 725 725
  208 74 74
  209 102 102
  210 8 8
  211 125 125
  212 16 16
  219 12 12
  221 63 63
  222 153 153
  223 47 47
  224 67 67
  225 8 8
  235 12 12
  237 8 8
  248 8 8
  249 20 20
  250 12 12
  258 35 35
  259 8 8
  260 47 47
  261 8 8
  262 8 8
  263 12 12
  266 24 24
  267 20 20
  269 24 24
  270 24 24
  271 27 27
  272 31 31
  274 12 12
  275 78 78
  277 74 74
  278 8 8
  284 12 12
  285 8 8
  286 172 172
  287 16 16
  288 176 176
  289 24 24
  291 259 259
  292 27 27
  299 78 78
  301 729 729
  303 999 999
  304 102 102
  305 290 290
  306 35 35
  309 8 8
  315 20 20
  317 16 16
  318 8 8
  319 8 8
  327 8 8
  329 35 35
  331 31 31
  333 12 12
  337 12 12
  339 39 39
  341 43 43
  346 360 360
  347 24 24
  348 349 349
  349 35 35
  355 74 74
  357 82 82
  358 12 12
  383 243 243
  384 16 16
  385 259 259
  386 55 55
  387 8 8
  398 16 16
  400 16 16
  426 59 59
  427 8 8
  428 74 74
  429 8 8
  556 8 8
  636 35 35
  637 12 12
  638 39 39
  639 12 12
  654 55 55
  655 16 16
  656 71 71
  657 20 20
  692 94 94
  693 27 27
  694 110 110
  695 31 31
  696 8 8