ACCESSION: MSBNK-Waters-WA001844
RECORD_TITLE: Amodiaquin; LC-ESI-Q; MS; POS; 15 V
DATE: 2016.01.19 (Created 2007.08.01, modified 2011.10.25)
AUTHORS: Nihon Waters K.K.
LICENSE: CC BY-NC

CH$NAME: Amodiaquin
CH$COMPOUND_CLASS: N/A
CH$FORMULA: C20H22ClN3O
CH$EXACT_MASS: 355.14514
CH$SMILES: CCN(CC)Cc(c(O)3)cc(cc3)Nc(c2)c(c1)c(nc2)cc(Cl)c1
CH$IUPAC: InChI=1S/C20H22ClN3O/c1-3-24(4-2)13-14-11-16(6-8-20(14)25)23-18-9-10-22-19-12-15(21)5-7-17(18)19/h5-12,25H,3-4,13H2,1-2H3,(H,22,23)
CH$LINK: CAS 86-42-0
CH$LINK: INCHIKEY OVCDSSHSILBFBN-UHFFFAOYSA-N
CH$LINK: COMPTOX DTXSID2022597

AC$INSTRUMENT: ZQ, Waters
AC$INSTRUMENT_TYPE: LC-ESI-Q
AC$MASS_SPECTROMETRY: MS_TYPE MS
AC$MASS_SPECTROMETRY: ION_MODE POSITIVE
AC$MASS_SPECTROMETRY: IONIZATION ESI
AC$CHROMATOGRAPHY: RETENTION_TIME 10.800 min
AC$CHROMATOGRAPHY: COLUMN_NAME 2.1 mm id - 3. 5{mu}m XTerra C18MS
AC$CHROMATOGRAPHY: COLUMN_TEMPERATURE 35 C
AC$CHROMATOGRAPHY: SAMPLING_CONE 15 V

MS$FOCUSED_ION: PRECURSOR_TYPE [M+H]+
MS$DATA_PROCESSING: FIND_PEAK ignore rel.int. < 5

PK$SPLASH: splash10-0a4i-0109000000-6e86559b30a9837263f6
PK$NUM_PEAK: 11
PK$PEAK: m/z int. rel.int.
  122 8 8
  179 168 168
  180 86 86
  199 102 102
  200 39 39
  283 8 8
  356 999 999
  357 231 231
  358 345 345
  359 78 78
  360 8 8