ACCESSION: MSBNK-Waters-WA001881
RECORD_TITLE: Ramipril; LC-ESI-Q; MS; POS; 30 V
DATE: 2016.01.19 (Created 2007.08.01, modified 2011.05.06)
AUTHORS: Nihon Waters K.K.
LICENSE: CC BY-NC

CH$NAME: Ramipril
CH$COMPOUND_CLASS: N/A
CH$FORMULA: C23H32N2O5
CH$EXACT_MASS: 416.23112
CH$SMILES: CCOC(=O)C(CCc(c3)cccc3)NC(C)C(=O)N(C(C(O)=O)1)C([H])(C2)C([H])(CC2)C1
CH$IUPAC: InChI=1S/C23H32N2O5/c1-3-30-23(29)18(13-12-16-8-5-4-6-9-16)24-15(2)21(26)25-19-11-7-10-17(19)14-20(25)22(27)28/h4-6,8-9,15,17-20,24H,3,7,10-14H2,1-2H3,(H,27,28)/t15-,17-,18-,19-,20-/m0/s1
CH$LINK: CAS 87333-19-5
CH$LINK: INCHIKEY HDACQVRGBOVJII-JBDAPHQKSA-N
CH$LINK: COMPTOX DTXSID8023551

AC$INSTRUMENT: ZQ, Waters
AC$INSTRUMENT_TYPE: LC-ESI-Q
AC$MASS_SPECTROMETRY: MS_TYPE MS
AC$MASS_SPECTROMETRY: ION_MODE POSITIVE
AC$MASS_SPECTROMETRY: IONIZATION ESI
AC$CHROMATOGRAPHY: RETENTION_TIME 14.510 min
AC$CHROMATOGRAPHY: COLUMN_NAME 2.1 mm id - 3. 5{mu}m XTerra C18MS
AC$CHROMATOGRAPHY: COLUMN_TEMPERATURE 35 C
AC$CHROMATOGRAPHY: SAMPLING_CONE 30 V

MS$DATA_PROCESSING: FIND_PEAK ignore rel.int. < 5

PK$SPLASH: splash10-014i-0010900000-180d5f22d890e3db943e
PK$NUM_PEAK: 9
PK$PEAK: m/z int. rel.int.
  156 8 8
  234 227 227
  235 27 27
  242 24 24
  343 35 35
  344 8 8
  417 999 999
  418 259 259
  419 39 39