ACCESSION: MSBNK-Waters-WA002019
RECORD_TITLE: Sulpiride; LC-ESI-Q; MS; POS; 90 V
DATE: 2016.01.19 (Created 2007.08.01, modified 2011.05.06)
AUTHORS: Nihon Waters K.K.
LICENSE: CC BY-NC

CH$NAME: Sulpiride
CH$COMPOUND_CLASS: N/A
CH$FORMULA: C15H23N3O4S
CH$EXACT_MASS: 341.14093
CH$SMILES: CCN(C2)C(CC2)CNC(=O)c(c(OC)1)cc(cc1)S(N)(=O)=O
CH$IUPAC: InChI=1S/C15H23N3O4S/c1-3-18-8-4-5-11(18)10-17-15(19)13-9-12(23(16,20)21)6-7-14(13)22-2/h6-7,9,11H,3-5,8,10H2,1-2H3,(H,17,19)(H2,16,20,21)
CH$LINK: CAS 15676-16-1
CH$LINK: INCHIKEY BGRJTUBHPOOWDU-UHFFFAOYSA-N
CH$LINK: COMPTOX DTXSID1042574

AC$INSTRUMENT: ZQ, Waters
AC$INSTRUMENT_TYPE: LC-ESI-Q
AC$MASS_SPECTROMETRY: MS_TYPE MS
AC$MASS_SPECTROMETRY: ION_MODE POSITIVE
AC$MASS_SPECTROMETRY: IONIZATION ESI
AC$CHROMATOGRAPHY: RETENTION_TIME 2.650 min
AC$CHROMATOGRAPHY: COLUMN_NAME 2.1 mm id - 3. 5{mu}m XTerra C18MS
AC$CHROMATOGRAPHY: COLUMN_TEMPERATURE 35 C
AC$CHROMATOGRAPHY: SAMPLING_CONE 90 V

MS$DATA_PROCESSING: FIND_PEAK ignore rel.int. < 5

PK$SPLASH: splash10-03di-0980000000-16ee5d836a4ce5dec03c
PK$NUM_PEAK: 21
PK$PEAK: m/z int. rel.int.
  105 16 16
  107 71 71
  108 71 71
  109 43 43
  110 51 51
  112 717 717
  113 35 35
  116 20 20
  122 12 12
  133 20 20
  134 67 67
  139 39 39
  151 16 16
  171 12 12
  174 20 20
  184 31 31
  214 999 999
  215 71 71
  216 55 55
  217 12 12
  342 39 39