ACCESSION: MSBNK-Waters-WA002189
RECORD_TITLE: Promethazine (oxide); LC-ESI-Q; MS; POS; 30 V
DATE: 2016.01.19 (Created 2007.08.01, modified 2011.05.06)
AUTHORS: Nihon Waters K.K.
LICENSE: CC BY-NC

CH$NAME: Promethazine (oxide)
CH$COMPOUND_CLASS: N/A
CH$FORMULA: C17H20N2S
CH$EXACT_MASS: 284.13472
CH$SMILES: CN(C)C(C)CN(c21)c(c3)c(ccc3)Sc(cccc2)1
CH$IUPAC: InChI=1S/C17H20N2S/c1-13(18(2)3)12-19-14-8-4-6-10-16(14)20-17-11-7-5-9-15(17)19/h4-11,13H,12H2,1-3H3
CH$LINK: CAS 60-87-7
CH$LINK: INCHIKEY PWWVAXIEGOYWEE-UHFFFAOYSA-N
CH$LINK: COMPTOX DTXSID7023518

AC$INSTRUMENT: ZQ, Waters
AC$INSTRUMENT_TYPE: LC-ESI-Q
AC$MASS_SPECTROMETRY: MS_TYPE MS
AC$MASS_SPECTROMETRY: ION_MODE POSITIVE
AC$MASS_SPECTROMETRY: IONIZATION ESI
AC$CHROMATOGRAPHY: RETENTION_TIME 14.220 min
AC$CHROMATOGRAPHY: COLUMN_NAME 2.1 mm id - 3. 5{mu}m XTerra C18MS
AC$CHROMATOGRAPHY: COLUMN_TEMPERATURE 35 C
AC$CHROMATOGRAPHY: SAMPLING_CONE 30 V

MS$DATA_PROCESSING: FIND_PEAK ignore rel.int. < 5

PK$SPLASH: splash10-000i-0095000000-07293e909062347b130f
PK$NUM_PEAK: 16
PK$PEAK: m/z int. rel.int.
  198 145 145
  199 16 16
  212 16 16
  240 172 172
  241 24 24
  256 78 78
  257 12 12
  285 999 999
  286 176 176
  287 63 63
  301 270 270
  302 47 47
  303 16 16
  317 451 451
  318 78 78
  319 24 24