ACCESSION: MSBNK-Waters-WA002442
RECORD_TITLE: Triprolidine; LC-ESI-Q; MS; POS; 15 V
DATE: 2016.01.19 (Created 2007.08.01, modified 2011.05.06)
AUTHORS: Nihon Waters K.K.
LICENSE: CC BY-NC

CH$NAME: Triprolidine
CH$COMPOUND_CLASS: N/A
CH$FORMULA: C19H22N2
CH$EXACT_MASS: 278.17830
CH$SMILES: Cc(c3)ccc(c3)C(=C([H])CN(C2)CCC2)c(c1)nccc1
CH$IUPAC: InChI=1S/C19H22N2/c1-16-7-9-17(10-8-16)18(19-6-2-3-12-20-19)11-15-21-13-4-5-14-21/h2-3,6-12H,4-5,13-15H2,1H3/b18-11+
CH$LINK: CAS 486-12-4
CH$LINK: INCHIKEY CBEQULMOCCWAQT-WOJGMQOQSA-N
CH$LINK: COMPTOX DTXSID3023718

AC$INSTRUMENT: ZQ, Waters
AC$INSTRUMENT_TYPE: LC-ESI-Q
AC$MASS_SPECTROMETRY: MS_TYPE MS
AC$MASS_SPECTROMETRY: ION_MODE POSITIVE
AC$MASS_SPECTROMETRY: IONIZATION ESI
AC$CHROMATOGRAPHY: RETENTION_TIME 13.580 min
AC$CHROMATOGRAPHY: COLUMN_NAME 2.1 mm id - 3. 5{mu}m XTerra C18MS
AC$CHROMATOGRAPHY: COLUMN_TEMPERATURE 35 C
AC$CHROMATOGRAPHY: SAMPLING_CONE 15 V

MS$DATA_PROCESSING: FIND_PEAK ignore rel.int. < 5

PK$SPLASH: splash10-004i-0090000000-8f9f70da143c74ff02bd
PK$NUM_PEAK: 5
PK$PEAK: m/z int. rel.int.
  208 110 110
  209 16 16
  279 999 999
  280 180 180
  281 16 16