ACCESSION: MSBNK-Waters-WA002887
RECORD_TITLE: N-1-(Hydroxyethyl)flurazepam; LC-ESI-Q; MS; POS; 60 V
DATE: 2016.01.19 (Created 2007.08.01, modified 2011.05.06)
AUTHORS: Nihon Waters K.K.
LICENSE: CC BY-NC

CH$NAME: N-1-(Hydroxyethyl)flurazepam
CH$COMPOUND_CLASS: N/A
CH$FORMULA: C17H14ClFN2O2
CH$EXACT_MASS: 332.07278
CH$SMILES: OCCN(C(=O)2)c(c3)c(cc(Cl)c3)C(=NC2)c(c1)c(F)ccc1
CH$IUPAC: InChI=1S/C17H14ClFN2O2/c18-11-5-6-15-13(9-11)17(12-3-1-2-4-14(12)19)20-10-16(23)21(15)7-8-22/h1-6,9,22H,7-8,10H2
CH$LINK: CAS 20971-53-3
CH$LINK: INCHIKEY FOCBRQQHNOKOJQ-UHFFFAOYSA-N
CH$LINK: COMPTOX DTXSID10175152

AC$INSTRUMENT: ZQ, Waters
AC$INSTRUMENT_TYPE: LC-ESI-Q
AC$MASS_SPECTROMETRY: MS_TYPE MS
AC$MASS_SPECTROMETRY: ION_MODE POSITIVE
AC$MASS_SPECTROMETRY: IONIZATION ESI
AC$CHROMATOGRAPHY: RETENTION_TIME 15.400 min
AC$CHROMATOGRAPHY: COLUMN_NAME 2.1 mm id - 3. 5{mu}m XTerra C18MS
AC$CHROMATOGRAPHY: COLUMN_TEMPERATURE 35 C
AC$CHROMATOGRAPHY: SAMPLING_CONE 60 V

MS$DATA_PROCESSING: FIND_PEAK ignore rel.int. < 5

PK$SPLASH: splash10-0a4i-0976000000-cdb5e235c0104b2b9a0d
PK$NUM_PEAK: 120
PK$PEAK: m/z int. rel.int.
  109 999 999
  110 55 55
  117 8 8
  120 8 8
  123 278 278
  124 24 24
  125 16 16
  127 12 12
  130 16 16
  131 153 153
  132 12 12
  134 16 16
  138 16 16
  140 67 67
  141 35 35
  142 20 20
  143 12 12
  150 51 51
  152 16 16
  153 24 24
  154 8 8
  155 8 8
  156 12 12
  158 16 16
  159 16 16
  162 12 12
  164 12 12
  165 8 8
  166 204 204
  167 43 43
  168 82 82
  169 12 12
  170 8 8
  180 8 8
  184 145 145
  185 8 8
  186 47 47
  191 20 20
  193 12 12
  194 274 274
  195 16 16
  196 90 90
  197 12 12
  211 243 243
  212 90 90
  214 47 47
  219 8 8
  222 8 8
  223 31 31
  224 27 27
  225 118 118
  226 43 43
  230 8 8
  232 20 20
  234 27 27
  235 8 8
  236 16 16
  237 8 8
  239 39 39
  240 90 90
  241 12 12
  242 27 27
  244 16 16
  245 12 12
  246 333 333
  247 43 43
  248 129 129
  249 20 20
  250 8 8
  251 16 16
  252 12 12
  253 8 8
  258 51 51
  259 74 74
  260 161 161
  261 59 59
  262 59 59
  263 12 12
  264 8 8
  267 8 8
  270 86 86
  271 24 24
  272 31 31
  273 16 16
  274 20 20
  276 35 35
  277 8 8
  278 16 16
  280 8 8
  285 8 8
  287 82 82
  288 8 8
  289 165 165
  290 27 27
  291 39 39
  292 8 8
  302 8 8
  303 8 8
  305 317 317
  306 43 43
  307 114 114
  308 16 16
  315 286 286
  316 31 31
  317 98 98
  318 8 8
  333 650 650
  334 98 98
  335 235 235
  336 27 27
  355 141 141
  356 20 20
  357 47 47
  358 12 12
  359 16 16
  371 31 31
  373 16 16
  396 16 16
  398 8 8
  399 8 8