ACCESSION: MSBNK-Athens_Univ-AU506501
RECORD_TITLE: Acetophenone; GC-APCI-QTOF; MS2; CE: 10 eV; R=35000; [M+H]+
DATE: 2021.04.20
AUTHORS: Chrysoula Kanakaki, Nikiforos Alygizakis, Nikolaos Thomaidis, University of Athens
LICENSE: CC BY
COPYRIGHT: Copyright (C) 2021 Department of Chemistry, University of Athens
COMMENT: CONFIDENCE standard compound
COMMENT: INTERNAL_ID 5065

CH$NAME: Acetophenone
CH$COMPOUND_CLASS: N/A; Food Contact Material
CH$FORMULA: C8H8O
CH$EXACT_MASS: 120.0575
CH$SMILES: CC(=O)C1=CC=CC=C1
CH$IUPAC: InChI=1S/C8H8O/c1-7(9)8-5-3-2-4-6-8/h2-6H,1H3
CH$LINK: CAS 98-86-2
CH$LINK: CHEBI 27632
CH$LINK: KEGG C07113
CH$LINK: PUBCHEM CID:7410
CH$LINK: INCHIKEY KWOLFJPFCHCOCG-UHFFFAOYSA-N
CH$LINK: CHEMSPIDER 7132

AC$INSTRUMENT: Bruker 450 GC coupled to maXis Impact
AC$INSTRUMENT_TYPE: GC-APCI-QTOF
AC$MASS_SPECTROMETRY: MS_TYPE MS2
AC$MASS_SPECTROMETRY: ION_MODE POSITIVE
AC$MASS_SPECTROMETRY: IONIZATION APCI
AC$MASS_SPECTROMETRY: FRAGMENTATION_MODE CID
AC$MASS_SPECTROMETRY: COLLISION_ENERGY 10 eV
AC$MASS_SPECTROMETRY: RESOLUTION 35000
AC$CHROMATOGRAPHY: COLUMN_NAME Rxi-5Sil MS column, 30m, 0.25mm i.d., 0.25µm film thickness, Restek
AC$CHROMATOGRAPHY: COLUMN_TEMPERATURE_GRADIENT 55oC at 0 min, 55oC at 3 min, 180oC at 11.33 min with 15oC/min, 280oC at 26.72 min with 6.5oC/min, 280oC at 31.72 min, 300oC at 33.72 min with 10oC/min, 300oC at 39 min
AC$CHROMATOGRAPHY: FLOW_RATE 1.5 mL/min
AC$CHROMATOGRAPHY: RETENTION_TIME 8.182 min
AC$CHROMATOGRAPHY: SOLVENT A Helium

MS$FOCUSED_ION: BASE_PEAK 121.0644
MS$FOCUSED_ION: PRECURSOR_M/Z 121.0648
MS$FOCUSED_ION: PRECURSOR_TYPE [M+H]+
MS$DATA_PROCESSING: RECALIBRATE identity on assigned fragments and MS1
MS$DATA_PROCESSING: WHOLE RMassBank 2.16.0

PK$SPLASH: splash10-00di-0900000000-c70a1009bba6e4f3a2c8
PK$ANNOTATION: m/z tentative_formula formula_count mass error(ppm)
  121.0645 C8H9O+ 1 121.0648 -2.04
PK$NUM_PEAK: 1
PK$PEAK: m/z int. rel.int.
  121.0645 1336 999