ACCESSION: MSBNK-Washington_State_Univ-BML80101
RECORD_TITLE: {3,4,5-triacetyloxy-6-[3-(4-methoxyphenyl)-4-oxochromen-6-yloxy]-2H-3,4,5,6-te trahydropyran-2-yl}methyl acetate; LC-ESI-QTOF; MS; NEGATIVE
DATE: 2016.01.19 (Created 2012.10.26)
AUTHORS: Cuthbertson DJ, Johnson SR, Lange BM, Institute of Biological Chemistry, Washington State University
LICENSE: CC BY-SA
COMMENT: relative retention time with respect to 9-anthracene Carboxylic Acid is 1.355

CH$NAME: {3,4,5-triacetyloxy-6-[3-(4-methoxyphenyl)-4-oxochromen-6-yloxy]-2H-3,4,5,6-te trahydropyran-2-yl}methyl acetate
CH$COMPOUND_CLASS: N/A
CH$FORMULA: C30H30O13
CH$EXACT_MASS: 598.168641
CH$SMILES: CC(=O)OCC1C(C(C(C(O1)OC2=CC3=C(C=C2)OC=C(C3=O)C4=CC=C(C=C4)OC)OC(=O)C)OC(=O)C)OC(=O)C
CH$IUPAC: InChI=1S/C30H30O13/c1-15(31)37-14-25-27(39-16(2)32)28(40-17(3)33)29(41-18(4)34)30(43-25)42-21-10-11-24-22(12-21)26(35)23(13-38-24)19-6-8-20(36-5)9-7-19/h6-13,25,27-30H,14H2,1-5H3
CH$LINK: CHEMSPIDER 2714501
CH$LINK: PUBCHEM CID:3473197
CH$LINK: INCHIKEY BMFOZSVMUKDKPN-UHFFFAOYSA-N

AC$INSTRUMENT: Agilent 1200 RRLC; Agilent 6520 QTOF
AC$INSTRUMENT_TYPE: LC-ESI-QTOF
AC$MASS_SPECTROMETRY: MS_TYPE MS
AC$MASS_SPECTROMETRY: ION_MODE NEGATIVE
AC$MASS_SPECTROMETRY: SCANNING m/z 100-1000
AC$CHROMATOGRAPHY: COLUMN_NAME Agilent C8 Cartridge Column 2.1X30mm 3.5 micron (guard); Agilent SB-Aq 2.1x50mm 1.8 micron (analytical)
AC$CHROMATOGRAPHY: COLUMN_TEMPERATURE 60 C
AC$CHROMATOGRAPHY: FLOW_GRADIENT linear from 98A/2B at 0 min to 2A/98B at 13 min, hold 6 min at 2A/98B, reequilibration 98A/2B (5 min)
AC$CHROMATOGRAPHY: FLOW_RATE 0.6 ml/min
AC$CHROMATOGRAPHY: RETENTION_TIME 9.991
AC$CHROMATOGRAPHY: SOLVENT A water with 0.2% acetic acid
AC$CHROMATOGRAPHY: SOLVENT B methanol with 0.2% acetic acid

PK$SPLASH: splash10-0a4i-0000009000-d38230c25b40c66c51ed
PK$NUM_PEAK: 1
PK$PEAK: m/z int. rel.int.
  657.181904 13551 999