ACCESSION: MSBNK-Washington_State_Univ-BML80956
RECORD_TITLE: Cinoxacin; LC-ESI-QTOF; MS; NEGATIVE
DATE: 2016.01.19 (Created 2012.10.26)
AUTHORS: Cuthbertson DJ, Johnson SR, Lange BM, Institute of Biological Chemistry, Washington State University
LICENSE: CC BY-SA
COMMENT: relative retention time with respect to 9-anthracene Carboxylic Acid is 0.738

CH$NAME: Cinoxacin
CH$COMPOUND_CLASS: N/A
CH$FORMULA: C12H10N2O5
CH$EXACT_MASS: 262.058971
CH$SMILES: CCN1C2=CC3=C(C=C2C(=O)C(=N1)C(=O)O)OCO3
CH$IUPAC: InChI=1S/C12H10N2O5/c1-2-14-7-4-9-8(18-5-19-9)3-6(7)11(15)10(13-14)12(16)17/h3-4H,2,5H2,1H3,(H,16,17)
CH$LINK: CAS 28657-80-9
CH$LINK: CHEMSPIDER 2660
CH$LINK: PUBCHEM CID:2762
CH$LINK: INCHIKEY VDUWPHTZYNWKRN-UHFFFAOYSA-N
CH$LINK: COMPTOX DTXSID8022822

AC$INSTRUMENT: Agilent 1200 RRLC; Agilent 6520 QTOF
AC$INSTRUMENT_TYPE: LC-ESI-QTOF
AC$MASS_SPECTROMETRY: MS_TYPE MS
AC$MASS_SPECTROMETRY: ION_MODE NEGATIVE
AC$MASS_SPECTROMETRY: SCANNING m/z 100-1000
AC$CHROMATOGRAPHY: COLUMN_NAME Agilent C8 Cartridge Column 2.1X30mm 3.5 micron (guard); Agilent SB-Aq 2.1x50mm 1.8 micron (analytical)
AC$CHROMATOGRAPHY: COLUMN_TEMPERATURE 60 C
AC$CHROMATOGRAPHY: FLOW_GRADIENT linear from 98A/2B at 0 min to 2A/98B at 13 min, hold 6 min at 2A/98B, reequilibration 98A/2B (5 min)
AC$CHROMATOGRAPHY: FLOW_RATE 0.6 ml/min
AC$CHROMATOGRAPHY: RETENTION_TIME 5.450
AC$CHROMATOGRAPHY: SOLVENT A water with 0.2% acetic acid
AC$CHROMATOGRAPHY: SOLVENT B methanol with 0.2% acetic acid

PK$SPLASH: splash10-03di-0090000000-4d4172ebc099ea9eb0dc
PK$NUM_PEAK: 1
PK$PEAK: m/z int. rel.int.
  261.0517235 30378 999