ACCESSION: MSBNK-Washington_State_Univ-BML80990
RECORD_TITLE: Coumarin 106; LC-ESI-QTOF; MS; POSITIVE
DATE: 2016.01.19 (Created 2012.10.26)
AUTHORS: Cuthbertson DJ, Johnson SR, Lange BM, Institute of Biological Chemistry, Washington State University
LICENSE: CC BY-SA
COMMENT: relative retention time with respect to 9-anthracene Carboxylic Acid is 1.417

CH$NAME: Coumarin 106
CH$COMPOUND_CLASS: N/A
CH$FORMULA: C18H19NO2
CH$EXACT_MASS: 281.141579
CH$SMILES: C1CC2=C(C1)C(=O)OC3=C4CCCN5C4=C(CCC5)C=C23
CH$IUPAC: InChI=1S/C18H19NO2/c20-18-13-6-1-5-12(13)15-10-11-4-2-8-19-9-3-7-14(16(11)19)17(15)21-18/h10H,1-9H2
CH$LINK: CAS 41175-45-5
CH$LINK: CHEMSPIDER 90670
CH$LINK: PUBCHEM CID:100336
CH$LINK: INCHIKEY LLSRPENMALNOFW-UHFFFAOYSA-N
CH$LINK: COMPTOX DTXSID5068285

AC$INSTRUMENT: Agilent 1200 RRLC; Agilent 6520 QTOF
AC$INSTRUMENT_TYPE: LC-ESI-QTOF
AC$MASS_SPECTROMETRY: MS_TYPE MS
AC$MASS_SPECTROMETRY: ION_MODE POSITIVE
AC$MASS_SPECTROMETRY: SCANNING m/z 100-1000
AC$CHROMATOGRAPHY: COLUMN_NAME Agilent C8 Cartridge Column 2.1X30mm 3.5 micron (guard); Agilent SB-Aq 2.1x50mm 1.8 micron (analytical)
AC$CHROMATOGRAPHY: COLUMN_TEMPERATURE 60 C
AC$CHROMATOGRAPHY: FLOW_GRADIENT linear from 98A/2B at 0 min to 2A/98B at 13 min, hold 6 min at 2A/98B, reequilibration 98A/2B (5 min)
AC$CHROMATOGRAPHY: FLOW_RATE 0.6 ml/min
AC$CHROMATOGRAPHY: RETENTION_TIME 10.438
AC$CHROMATOGRAPHY: SOLVENT A water with 0.2% acetic acid
AC$CHROMATOGRAPHY: SOLVENT B methanol with 0.2% acetic acid

PK$SPLASH: splash10-001i-0094000000-8c522efdd99cf66d9897
PK$NUM_PEAK: 2
PK$PEAK: m/z int. rel.int.
  282.1488765 814093 999
  304.130818 405611 498