ACCESSION: MSBNK-Washington_State_Univ-BML81067
RECORD_TITLE: Dehydroglaucine; LC-APCI-QTOF; MS; POSITIVE
DATE: 2016.01.19 (Created 2012.10.26)
AUTHORS: Cuthbertson DJ, Johnson SR, Lange BM, Institute of Biological Chemistry, Washington State University
LICENSE: CC BY-SA
COMMENT: relative retention time with respect to 9-anthracene Carboxylic Acid is 1.323

CH$NAME: Dehydroglaucine
CH$COMPOUND_CLASS: N/A
CH$FORMULA: C21H23NO4
CH$EXACT_MASS: 353.162708
CH$SMILES: CN1CCC2=CC(=C(C3=C4C=C(C(=CC4=CC1=C23)OC)OC)OC)OC
CH$IUPAC: InChI=1S/C21H23NO4/c1-22-7-6-12-9-18(25-4)21(26-5)20-14-11-17(24-3)16(23-2)10-13(14)8-15(22)19(12)20/h8-11H,6-7H2,1-5H3
CH$LINK: CAS 22212-26-6
CH$LINK: CHEMSPIDER 353520
CH$LINK: PUBCHEM CID:398788
CH$LINK: INCHIKEY RZUHGAKUNBFQJS-UHFFFAOYSA-N
CH$LINK: COMPTOX DTXSID30176762

AC$INSTRUMENT: Agilent 1200 RRLC; Agilent 6520 QTOF
AC$INSTRUMENT_TYPE: LC-APCI-QTOF
AC$MASS_SPECTROMETRY: MS_TYPE MS
AC$MASS_SPECTROMETRY: ION_MODE POSITIVE
AC$MASS_SPECTROMETRY: SCANNING m/z 100-1000
AC$CHROMATOGRAPHY: COLUMN_NAME Agilent C8 Cartridge Column 2.1X30mm 3.5 micron (guard); Agilent SB-Aq 2.1x50mm 1.8 micron (analytical)
AC$CHROMATOGRAPHY: COLUMN_TEMPERATURE 60 C
AC$CHROMATOGRAPHY: FLOW_GRADIENT linear from 98A/2B at 0 min to 2A/98B at 13 min, hold 6 min at 2A/98B, reequilibration 98A/2B (5 min)
AC$CHROMATOGRAPHY: FLOW_RATE 0.6 ml/min
AC$CHROMATOGRAPHY: RETENTION_TIME 9.759
AC$CHROMATOGRAPHY: SOLVENT A water with 0.2% acetic acid
AC$CHROMATOGRAPHY: SOLVENT B methanol with 0.2% acetic acid

PK$SPLASH: splash10-0udi-0009000000-69d541311cf50a3e609d
PK$NUM_PEAK: 1
PK$PEAK: m/z int. rel.int.
  354.1699765 4980961 999