ACCESSION: MSBNK-Washington_State_Univ-BML81130
RECORD_TITLE: DL-Methionine sulfoxide; LC-ESI-QTOF; MS; POSITIVE
DATE: 2016.01.19 (Created 2012.10.26)
AUTHORS: Cuthbertson DJ, Johnson SR, Lange BM, Institute of Biological Chemistry, Washington State University
LICENSE: CC BY-SA
COMMENT: relative retention time with respect to 9-anthracene Carboxylic Acid is 0.050

CH$NAME: DL-Methionine sulfoxide
CH$COMPOUND_CLASS: N/A
CH$FORMULA: C5H11NO3S
CH$EXACT_MASS: 165.045964
CH$SMILES: CS(=O)CCC(C(=O)O)N
CH$IUPAC: InChI=1S/C5H11NO3S/c1-10(9)3-2-4(6)5(7)8/h4H,2-3,6H2,1H3,(H,7,8)
CH$LINK: CAS 454-41-1
CH$LINK: CHEMSPIDER 824
CH$LINK: PUBCHEM CID:847
CH$LINK: INCHIKEY QEFRNWWLZKMPFJ-UHFFFAOYSA-N
CH$LINK: COMPTOX DTXSID60866947

AC$INSTRUMENT: Agilent 1200 RRLC; Agilent 6520 QTOF
AC$INSTRUMENT_TYPE: LC-ESI-QTOF
AC$MASS_SPECTROMETRY: MS_TYPE MS
AC$MASS_SPECTROMETRY: ION_MODE POSITIVE
AC$MASS_SPECTROMETRY: SCANNING m/z 100-1000
AC$CHROMATOGRAPHY: COLUMN_NAME Agilent C8 Cartridge Column 2.1X30mm 3.5 micron (guard); Agilent SB-Aq 2.1x50mm 1.8 micron (analytical)
AC$CHROMATOGRAPHY: COLUMN_TEMPERATURE 60 C
AC$CHROMATOGRAPHY: FLOW_GRADIENT linear from 98A/2B at 0 min to 2A/98B at 13 min, hold 6 min at 2A/98B, reequilibration 98A/2B (5 min)
AC$CHROMATOGRAPHY: FLOW_RATE 0.6 ml/min
AC$CHROMATOGRAPHY: RETENTION_TIME 0.367
AC$CHROMATOGRAPHY: SOLVENT A water with 0.2% acetic acid
AC$CHROMATOGRAPHY: SOLVENT B methanol with 0.2% acetic acid

PK$SPLASH: splash10-014i-0900000000-9111119aaec97e569364
PK$NUM_PEAK: 2
PK$PEAK: m/z int. rel.int.
  166.0532765 1016936 999
  188.035218 16094 16