ACCESSION: MSBNK-Washington_State_Univ-BML81487
RECORD_TITLE: Isosafrole; LC-APCI-QTOF; MS; POSITIVE
DATE: 2016.01.19 (Created 2012.10.26)
AUTHORS: Cuthbertson DJ, Johnson SR, Lange BM, Institute of Biological Chemistry, Washington State University
LICENSE: CC BY-SA
COMMENT: relative retention time with respect to 9-anthracene Carboxylic Acid is 1.089

CH$NAME: Isosafrole
CH$COMPOUND_CLASS: N/A
CH$FORMULA: C10H10O2
CH$EXACT_MASS: 162.06808
CH$SMILES: CC=CC1=CC2=C(C=C1)OCO2
CH$IUPAC: InChI=1S/C10H10O2/c1-2-3-8-4-5-9-10(6-8)12-7-11-9/h2-6H,7H2,1H3
CH$LINK: CAS 120-58-1
CH$LINK: CHEMSPIDER 8131
CH$LINK: PUBCHEM CID:8439
CH$LINK: INCHIKEY VHVOLFRBFDOUSH-UHFFFAOYSA-N
CH$LINK: COMPTOX DTXSID2020767

AC$INSTRUMENT: Agilent 1200 RRLC; Agilent 6520 QTOF
AC$INSTRUMENT_TYPE: LC-APCI-QTOF
AC$MASS_SPECTROMETRY: MS_TYPE MS
AC$MASS_SPECTROMETRY: ION_MODE POSITIVE
AC$MASS_SPECTROMETRY: SCANNING m/z 100-1000
AC$CHROMATOGRAPHY: COLUMN_NAME Agilent C8 Cartridge Column 2.1X30mm 3.5 micron (guard); Agilent SB-Aq 2.1x50mm 1.8 micron (analytical)
AC$CHROMATOGRAPHY: COLUMN_TEMPERATURE 60 C
AC$CHROMATOGRAPHY: FLOW_GRADIENT linear from 98A/2B at 0 min to 2A/98B at 13 min, hold 6 min at 2A/98B, reequilibration 98A/2B (5 min)
AC$CHROMATOGRAPHY: FLOW_RATE 0.6 ml/min
AC$CHROMATOGRAPHY: RETENTION_TIME 8.053
AC$CHROMATOGRAPHY: SOLVENT A water with 0.2% acetic acid
AC$CHROMATOGRAPHY: SOLVENT B methanol with 0.2% acetic acid

PK$SPLASH: splash10-03di-0900000000-815055f4ca67529da699
PK$NUM_PEAK: 1
PK$PEAK: m/z int. rel.int.
  163.0753765 218876 999