ACCESSION: MSBNK-Washington_State_Univ-BML81755
RECORD_TITLE: N-Acetylneuraminic acid methyl ester 1; LC-ESI-QTOF; MS; POSITIVE
DATE: 2016.01.19 (Created 2012.10.26)
AUTHORS: Cuthbertson DJ, Johnson SR, Lange BM, Institute of Biological Chemistry, Washington State University
LICENSE: CC BY-SA
COMMENT: relative retention time with respect to 9-anthracene Carboxylic Acid is 0.054

CH$NAME: N-Acetylneuraminic acid methyl ester 1
CH$COMPOUND_CLASS: N/A
CH$FORMULA: C12H21NO9
CH$EXACT_MASS: 323.121631
CH$SMILES: CC(=O)NC1C(CC(OC1C(C(CO)O)O)(C(=O)OC)O)O
CH$IUPAC: InChI=1S/C12H21NO9/c1-5(15)13-8-6(16)3-12(20,11(19)21-2)22-10(8)9(18)7(17)4-14/h6-10,14,16-18,20H,3-4H2,1-2H3,(H,13,15)
CH$LINK: CAS 50998-13-5
CH$LINK: CHEMSPIDER 2628120
CH$LINK: PUBCHEM CID:3383006
CH$LINK: INCHIKEY BKZQMWNJESHHSA-UHFFFAOYSA-N
CH$LINK: COMPTOX DTXSID30391978

AC$INSTRUMENT: Agilent 1200 RRLC; Agilent 6520 QTOF
AC$INSTRUMENT_TYPE: LC-ESI-QTOF
AC$MASS_SPECTROMETRY: MS_TYPE MS
AC$MASS_SPECTROMETRY: ION_MODE POSITIVE
AC$MASS_SPECTROMETRY: SCANNING m/z 100-1000
AC$CHROMATOGRAPHY: COLUMN_NAME Agilent C8 Cartridge Column 2.1X30mm 3.5 micron (guard); Agilent SB-Aq 2.1x50mm 1.8 micron (analytical)
AC$CHROMATOGRAPHY: COLUMN_TEMPERATURE 60 C
AC$CHROMATOGRAPHY: FLOW_GRADIENT linear from 98A/2B at 0 min to 2A/98B at 13 min, hold 6 min at 2A/98B, reequilibration 98A/2B (5 min)
AC$CHROMATOGRAPHY: FLOW_RATE 0.6 ml/min
AC$CHROMATOGRAPHY: RETENTION_TIME 0.395
AC$CHROMATOGRAPHY: SOLVENT A water with 0.2% acetic acid
AC$CHROMATOGRAPHY: SOLVENT B methanol with 0.2% acetic acid

PK$SPLASH: splash10-00di-0009000000-fd640eea16d5bed23f20
PK$NUM_PEAK: 2
PK$PEAK: m/z int. rel.int.
  324.1288765 401815 999
  346.110818 21770 54