ACCESSION: MSBNK-Washington_State_Univ-BML81776
RECORD_TITLE: Nalpha-FMOC-L-Tryptophan; LC-ESI-QTOF; MS; NEGATIVE
DATE: 2016.01.19 (Created 2012.10.26)
AUTHORS: Cuthbertson DJ, Johnson SR, Lange BM, Institute of Biological Chemistry, Washington State University
LICENSE: CC BY-SA
COMMENT: relative retention time with respect to 9-anthracene Carboxylic Acid is 1.268

CH$NAME: Nalpha-FMOC-L-Tryptophan
CH$COMPOUND_CLASS: N/A
CH$FORMULA: C26H22N2O4
CH$EXACT_MASS: 426.157957
CH$SMILES: C1=CC=C2C(=C1)C(C3=CC=CC=C32)COC(=O)NC(CC4=CNC5=CC=CC=C54)C(=O)O
CH$IUPAC: InChI=1S/C26H22N2O4/c29-25(30)24(13-16-14-27-23-12-6-5-7-17(16)23)28-26(31)32-15-22-20-10-3-1-8-18(20)19-9-2-4-11-21(19)22/h1-12,14,22,24,27H,13,15H2,(H,28,31)(H,29,30)
CH$LINK: CAS 35737-15-6
CH$LINK: CHEMSPIDER 848066
CH$LINK: PUBCHEM CID:100107
CH$LINK: INCHIKEY MGHMWKZOLAAOTD-UHFFFAOYSA-N
CH$LINK: COMPTOX DTXSID30875541

AC$INSTRUMENT: Agilent 1200 RRLC; Agilent 6520 QTOF
AC$INSTRUMENT_TYPE: LC-ESI-QTOF
AC$MASS_SPECTROMETRY: MS_TYPE MS
AC$MASS_SPECTROMETRY: ION_MODE NEGATIVE
AC$MASS_SPECTROMETRY: SCANNING m/z 100-1000
AC$CHROMATOGRAPHY: COLUMN_NAME Agilent C8 Cartridge Column 2.1X30mm 3.5 micron (guard); Agilent SB-Aq 2.1x50mm 1.8 micron (analytical)
AC$CHROMATOGRAPHY: COLUMN_TEMPERATURE 60 C
AC$CHROMATOGRAPHY: FLOW_GRADIENT linear from 98A/2B at 0 min to 2A/98B at 13 min, hold 6 min at 2A/98B, reequilibration 98A/2B (5 min)
AC$CHROMATOGRAPHY: FLOW_RATE 0.6 ml/min
AC$CHROMATOGRAPHY: RETENTION_TIME 9.299
AC$CHROMATOGRAPHY: SOLVENT A water with 0.2% acetic acid
AC$CHROMATOGRAPHY: SOLVENT B methanol with 0.2% acetic acid

PK$SPLASH: splash10-004i-0000900000-9ca6ab5278f28808f1f6
PK$NUM_PEAK: 1
PK$PEAK: m/z int. rel.int.
  425.1507235 29774 999