ACCESSION: MSBNK-Washington_State_Univ-BML82068
RECORD_TITLE: Rhamnopterin; LC-APCI-QTOF; MS; NEGATIVE
DATE: 2016.01.19 (Created 2012.10.26)
AUTHORS: Cuthbertson DJ, Johnson SR, Lange BM, Institute of Biological Chemistry, Washington State University
LICENSE: CC BY-SA
COMMENT: relative retention time with respect to 9-anthracene Carboxylic Acid is 0.055

CH$NAME: Rhamnopterin
CH$COMPOUND_CLASS: N/A
CH$FORMULA: C10H13N5O4
CH$EXACT_MASS: 267.096754
CH$SMILES: C[C@@H]([C@@H]([C@H](C1=CN=C2C(=N1)C(=O)N=C(N2)N)O)O)O
CH$IUPAC: InChI=1S/C10H13N5O4/c1-3(16)6(17)7(18)4-2-12-8-5(13-4)9(19)15-10(11)14-8/h2-3,6-7,16-18H,1H3,(H3,11,12,14,15,19)/t3-,6-,7-/m0/s1
CH$LINK: CAS 13392-24-0
CH$LINK: CHEMSPIDER 5036915
CH$LINK: PUBCHEM CID:135484652
CH$LINK: INCHIKEY QSVZLFABRHDXRR-ZIMNBKJVSA-N

AC$INSTRUMENT: Agilent 1200 RRLC; Agilent 6520 QTOF
AC$INSTRUMENT_TYPE: LC-APCI-QTOF
AC$MASS_SPECTROMETRY: MS_TYPE MS
AC$MASS_SPECTROMETRY: ION_MODE NEGATIVE
AC$MASS_SPECTROMETRY: SCANNING m/z 100-1000
AC$CHROMATOGRAPHY: COLUMN_NAME Agilent C8 Cartridge Column 2.1X30mm 3.5 micron (guard); Agilent SB-Aq 2.1x50mm 1.8 micron (analytical)
AC$CHROMATOGRAPHY: COLUMN_TEMPERATURE 60 C
AC$CHROMATOGRAPHY: FLOW_GRADIENT linear from 98A/2B at 0 min to 2A/98B at 13 min, hold 6 min at 2A/98B, reequilibration 98A/2B (5 min)
AC$CHROMATOGRAPHY: FLOW_RATE 0.6 ml/min
AC$CHROMATOGRAPHY: RETENTION_TIME 0.406
AC$CHROMATOGRAPHY: SOLVENT A water with 0.2% acetic acid
AC$CHROMATOGRAPHY: SOLVENT B methanol with 0.2% acetic acid

PK$SPLASH: splash10-014i-0090000000-cbf52f09923610b14678
PK$NUM_PEAK: 1
PK$PEAK: m/z int. rel.int.
  266.0895235 6028 999