ACCESSION: MSBNK-Washington_State_Univ-BML82130
RECORD_TITLE: Salsolidine; LC-ESI-QTOF; MS; POSITIVE
DATE: 2016.01.19 (Created 2012.10.26)
AUTHORS: Cuthbertson DJ, Johnson SR, Lange BM, Institute of Biological Chemistry, Washington State University
LICENSE: CC BY-SA
COMMENT: relative retention time with respect to 9-anthracene Carboxylic Acid is 0.138

CH$NAME: Salsolidine
CH$COMPOUND_CLASS: N/A
CH$FORMULA: C12H17NO2
CH$EXACT_MASS: 207.125929
CH$SMILES: CC1C2=CC(=C(C=C2CCN1)OC)OC
CH$IUPAC: InChI=1S/C12H17NO2/c1-8-10-7-12(15-3)11(14-2)6-9(10)4-5-13-8/h6-8,13H,4-5H2,1-3H3
CH$LINK: CAS 5784-74-7
CH$LINK: CHEMSPIDER 9880
CH$LINK: PUBCHEM CID:10302
CH$LINK: INCHIKEY HMYJLVDKPJHJCF-UHFFFAOYSA-N
CH$LINK: COMPTOX DTXSID20959384

AC$INSTRUMENT: Agilent 1200 RRLC; Agilent 6520 QTOF
AC$INSTRUMENT_TYPE: LC-ESI-QTOF
AC$MASS_SPECTROMETRY: MS_TYPE MS
AC$MASS_SPECTROMETRY: ION_MODE POSITIVE
AC$MASS_SPECTROMETRY: SCANNING m/z 100-1000
AC$CHROMATOGRAPHY: COLUMN_NAME Agilent C8 Cartridge Column 2.1X30mm 3.5 micron (guard); Agilent SB-Aq 2.1x50mm 1.8 micron (analytical)
AC$CHROMATOGRAPHY: COLUMN_TEMPERATURE 60 C
AC$CHROMATOGRAPHY: FLOW_GRADIENT linear from 98A/2B at 0 min to 2A/98B at 13 min, hold 6 min at 2A/98B, reequilibration 98A/2B (5 min)
AC$CHROMATOGRAPHY: FLOW_RATE 0.6 ml/min
AC$CHROMATOGRAPHY: RETENTION_TIME 1.009
AC$CHROMATOGRAPHY: SOLVENT A water with 0.2% acetic acid
AC$CHROMATOGRAPHY: SOLVENT B methanol with 0.2% acetic acid

PK$SPLASH: splash10-0a4i-0090000000-bb835fa9b3539453b7be
PK$NUM_PEAK: 1
PK$PEAK: m/z int. rel.int.
  208.1331765 3482439 999