ACCESSION: MSBNK-Washington_State_Univ-BML82137
RECORD_TITLE: Salsoline; LC-APCI-QTOF; MS; POSITIVE
DATE: 2016.01.19 (Created 2012.10.26)
AUTHORS: Cuthbertson DJ, Johnson SR, Lange BM, Institute of Biological Chemistry, Washington State University
LICENSE: CC BY-SA
COMMENT: relative retention time with respect to 9-anthracene Carboxylic Acid is 0.159

CH$NAME: Salsoline
CH$COMPOUND_CLASS: N/A
CH$FORMULA: C11H15NO2
CH$EXACT_MASS: 193.110279
CH$SMILES: CC1C2=CC(=C(C=C2CCN1)O)OC
CH$IUPAC: InChI=1S/C11H15NO2/c1-7-9-6-11(14-2)10(13)5-8(9)3-4-12-7/h5-7,12-13H,3-4H2,1-2H3
CH$LINK: CAS 89-31-6
CH$LINK: CHEMSPIDER 42492
CH$LINK: PUBCHEM CID:46695
CH$LINK: INCHIKEY YTPRLBGPGZHUPD-UHFFFAOYSA-N

AC$INSTRUMENT: Agilent 1200 RRLC; Agilent 6520 QTOF
AC$INSTRUMENT_TYPE: LC-APCI-QTOF
AC$MASS_SPECTROMETRY: MS_TYPE MS
AC$MASS_SPECTROMETRY: ION_MODE POSITIVE
AC$MASS_SPECTROMETRY: SCANNING m/z 100-1000
AC$CHROMATOGRAPHY: COLUMN_NAME Agilent C8 Cartridge Column 2.1X30mm 3.5 micron (guard); Agilent SB-Aq 2.1x50mm 1.8 micron (analytical)
AC$CHROMATOGRAPHY: COLUMN_TEMPERATURE 60 C
AC$CHROMATOGRAPHY: FLOW_GRADIENT linear from 98A/2B at 0 min to 2A/98B at 13 min, hold 6 min at 2A/98B, reequilibration 98A/2B (5 min)
AC$CHROMATOGRAPHY: FLOW_RATE 0.6 ml/min
AC$CHROMATOGRAPHY: RETENTION_TIME 1.174
AC$CHROMATOGRAPHY: SOLVENT A water with 0.2% acetic acid
AC$CHROMATOGRAPHY: SOLVENT B methanol with 0.2% acetic acid

PK$SPLASH: splash10-0006-0900000000-70e2e8c1a3a477941f5c
PK$NUM_PEAK: 1
PK$PEAK: m/z int. rel.int.
  194.1175765 5913144 999