ACCESSION: MSBNK-Washington_State_Univ-BML82252
RECORD_TITLE: Thermopsine; LC-APCI-QTOF; MS; POSITIVE
DATE: 2016.01.19 (Created 2012.10.26)
AUTHORS: Cuthbertson DJ, Johnson SR, Lange BM, Institute of Biological Chemistry, Washington State University
LICENSE: CC BY-SA
COMMENT: relative retention time with respect to 9-anthracene Carboxylic Acid is 0.155

CH$NAME: Thermopsine
CH$COMPOUND_CLASS: N/A
CH$FORMULA: C15H20N2O
CH$EXACT_MASS: 244.157563
CH$SMILES: C1CCN2C[C@H]3C[C@@H]([C@@H]2C1)CN4C3=CC=CC4=O
CH$IUPAC: InChI=1S/C15H20N2O/c18-15-6-3-5-14-11-8-12(10-17(14)15)13-4-1-2-7-16(13)9-11/h3,5-6,11-13H,1-2,4,7-10H2/t11-,12-,13+/m1/s1
CH$LINK: CAS 486-90-8
CH$LINK: CHEMSPIDER 553790
CH$LINK: PUBCHEM CID:638234
CH$LINK: INCHIKEY FQEQMASDZFXSJI-UPJWGTAASA-N

AC$INSTRUMENT: Agilent 1200 RRLC; Agilent 6520 QTOF
AC$INSTRUMENT_TYPE: LC-APCI-QTOF
AC$MASS_SPECTROMETRY: MS_TYPE MS
AC$MASS_SPECTROMETRY: ION_MODE POSITIVE
AC$MASS_SPECTROMETRY: SCANNING m/z 100-1000
AC$CHROMATOGRAPHY: COLUMN_NAME Agilent C8 Cartridge Column 2.1X30mm 3.5 micron (guard); Agilent SB-Aq 2.1x50mm 1.8 micron (analytical)
AC$CHROMATOGRAPHY: COLUMN_TEMPERATURE 60 C
AC$CHROMATOGRAPHY: FLOW_GRADIENT linear from 98A/2B at 0 min to 2A/98B at 13 min, hold 6 min at 2A/98B, reequilibration 98A/2B (5 min)
AC$CHROMATOGRAPHY: FLOW_RATE 0.6 ml/min
AC$CHROMATOGRAPHY: RETENTION_TIME 1.141
AC$CHROMATOGRAPHY: SOLVENT A water with 0.2% acetic acid
AC$CHROMATOGRAPHY: SOLVENT B methanol with 0.2% acetic acid

PK$SPLASH: splash10-0002-0090000000-db9f70ee2966b054f669
PK$NUM_PEAK: 1
PK$PEAK: m/z int. rel.int.
  245.1648765 2404253 999