ACCESSION: MSBNK-RIKEN_NPDepo-CB000009
RECORD_TITLE: Skimmianine; LC-ESI-QQQ; MS; [M+H]+
DATE: 2018.04.04
AUTHORS: Nogawa T, Okano A, CSRS, RIKEN
LICENSE: CC BY
COMMENT: Origin: Plant
COMMENT: SubCategory_DNP: Alkaloids derived from anthranilic acid, Quinoline alkaloids

CH$NAME: Skimmianine
CH$COMPOUND_CLASS: Alkaloids
CH$FORMULA: C14H13NO4
CH$EXACT_MASS: 259.264
CH$SMILES: COc1ccc2c(OC)c3ccoc3nc2c1OC
CH$IUPAC: InChI=1S/C14H13NO4/c1-16-10-5-4-8-11(13(10)18-3)15-14-9(6-7-19-14)12(8)17-2/h4-7H,1-3H3
CH$LINK: CAS 83-95-4
CH$LINK: CHEMSPIDER 6502
CH$LINK: INCHIKEY SLSIBLKBHNKZTB-UHFFFAOYSA-N
CH$LINK: COMPTOX DTXSID90232116
CH$LINK: PUBCHEM CID:6760

AC$INSTRUMENT: ABSciex API3200 LC/MS system
AC$INSTRUMENT_TYPE: LC-ESI-QQQ
AC$MASS_SPECTROMETRY: MS_TYPE MS
AC$MASS_SPECTROMETRY: ION_MODE POSITIVE

MS$FOCUSED_ION: PRECURSOR_TYPE [M+H]+

PK$SPLASH: splash10-0bt9-0090000000-cc0821424945ceafe234
PK$NUM_PEAK: 167
PK$PEAK: m/z int. rel.int.
  100.5000 628809.6875 50
  100.6000 654958.5625 52
  100.7000 662782.5000 53
  100.8000 496211.9688 39
  100.9000 661547.3125 53
  101.0000 531626.1250 42
  101.1000 430942.5938 34
  101.2000 385439.3750 30
  101.3000 335200.4688 26
  101.4000 269931.0938 21
  183.4000 320993.5313 25
  183.5000 528537.7500 42
  183.6000 492093.9063 39
  183.7000 659282.3750 52
  183.8000 693049.5000 55
  183.9000 591336.3750 47
  184.0000 562922.6250 45
  184.1000 444119.9375 35
  184.2000 383586.2188 30
  184.3000 405411.3750 32
  184.4000 363820.0938 28
  198.4000 767996.0625 61
  198.5000 1445191.3750 117
  198.6000 1839072.6250 149
  198.7000 1944285.8750 158
  198.8000 2268779.7500 184
  198.9000 1827954.0000 148
  199.0000 1833307.2500 149
  199.1000 1759802.1250 143
  199.2000 1732418.0000 140
  199.3000 1348625.8750 109
  199.4000 1127286.3750 91
  199.5000 454208.9063 36
  199.6000 323670.1875 25
  199.9000 370202.9375 29
  200.0000 272607.7188 21
  200.1000 320581.7188 25
  200.2000 329023.5000 25
  200.3000 271990.0313 21
  200.4000 666694.6875 53
  200.5000 874650.6875 70
  200.8000 301227.4063 23
  200.9000 526478.6875 42
  201.6000 324287.9063 25
  201.7000 380497.8125 30
  201.8000 318728.6875 25
  201.9000 414059.0000 32
  202.0000 379674.2188 30
  202.1000 385233.4063 30
  202.2000 311110.4688 24
  202.3000 332112.0000 26
  202.4000 312551.7188 24
  215.3000 359084.4688 28
  215.4000 987688.2500 79
  215.5000 1301475.3750 105
  215.6000 1880046.0000 152
  215.7000 1802011.1250 146
  215.8000 2021085.5000 164
  215.9000 1983818.1250 161
  216.0000 2143800.2500 174
  216.1000 1880046.0000 152
  216.2000 1835572.2500 149
  216.3000 1805923.2500 146
  216.4000 1460221.8750 118
  216.5000 417353.3125 33
  216.6000 274460.7813 21
  216.7000 325729.1563 25
  216.8000 359290.3438 28
  216.9000 325317.3438 25
  217.1000 589277.3750 47
  217.2000 310904.5938 24
  226.3000 1567494.2500 127
  226.4000 4333309.5000 353
  226.5000 5390179.5000 440
  226.6000 5980691.0000 488
  226.7000 6027637.0000 492
  226.8000 6125643.5000 500
  226.9000 6517258.5000 532
  227.0000 6435312.5000 525
  227.1000 6472374.0000 528
  227.2000 5540071.5000 452
  227.3000 5287024.0000 431
  227.4000 4341133.5000 354
  227.5000 1899400.3750 154
  227.6000 1599202.3750 129
  227.7000 1699680.2500 138
  227.8000 1454868.5000 118
  227.9000 1682590.5000 136
  228.0000 4664598.0000 380
  228.1000 579600.2500 46
  228.2000 517419.3125 41
  228.3000 746994.6250 60
  228.4000 503830.0313 40
  229.0000 275078.5000 21
  229.3000 322846.5938 25
  229.4000 382762.6250 30
  229.5000 559834.0625 44
  229.6000 615426.3750 49
  229.7000 557569.2500 44
  229.8000 683784.1875 54
  229.9000 703962.1250 56
  230.0000 530390.8125 42
  230.1000 769025.5625 61
  230.2000 705815.1875 56
  230.3000 699844.1250 56
  230.4000 421265.3438 33
  230.5000 282490.7813 22
  243.4000 462444.7813 36
  243.5000 538420.6875 43
  243.6000 922418.8125 74
  243.7000 819058.4375 66
  243.8000 989541.2500 79
  243.9000 928389.8125 74
  244.0000 814528.7500 65
  244.1000 859002.5625 69
  244.2000 880415.8750 71
  244.3000 1778950.7500 144
  244.4000 2907472.5000 236
  244.5000 4183416.5000 341
  244.6000 4398578.5000 358
  244.7000 4422669.0000 360
  244.8000 4379018.0000 357
  244.9000 4134824.7500 337
  245.0000 4432346.0000 361
  245.1000 3981637.5000 324
  245.2000 3903807.7500 318
  245.3000 3489955.2500 284
  245.4000 5571986.0000 454
  245.5000 4242715.0000 346
  245.6000 501153.4375 40
  245.7000 633545.3125 50
  245.8000 313375.3125 24
  245.9000 635398.3125 50
  246.1000 355790.0938 28
  246.2000 487976.0313 38
  246.3000 355996.0313 28
  246.4000 315846.1250 24
  259.2000 427030.5000 33
  259.3000 2124651.7500 172
  259.4000 6771954.0000 553
  259.5000 7903565.0000 645
  259.6000 8997494.0000 735
  259.7000 8975465.0000 733
  259.8000 9070177.0000 741
  259.9000 8860573.0000 724
  260.0000 8499636.0000 694
  260.1000 9092621.0000 743
  260.2000 12219784.0000 999
  260.3000 10574050.0000 864
  260.4000 3255026.5000 265
  260.5000 1250206.8750 101
  261.0000 1601673.5000 130
  261.1000 2721959.7500 221
  261.2000 2559094.5000 208
  261.3000 2442145.0000 198
  261.4000 2222452.7500 180
  261.5000 951038.4375 76
  261.6000 633545.1875 50
  261.7000 604925.5625 48
  261.8000 501771.0625 40
  261.9000 440825.5625 35
  262.0000 351878.0625 27
  262.1000 414882.5313 32
  262.2000 482210.9375 38
  262.3000 351054.5000 27
  262.4000 366290.8750 28
  267.5000 270754.5938 21