ACCESSION: MSBNK-RIKEN_NPDepo-CB000029
RECORD_TITLE: Ormosanine; LC-ESI-QQQ; MS; [M+H]+
DATE: 2018.04.04
AUTHORS: Nogawa T, Okano A, CSRS, RIKEN
LICENSE: CC BY
COMMENT: Origin: Plant
COMMENT: Formula(Parent): C20H35N3
COMMENT: Bottle Name:Ormosanine
COMMENT: PRIME Parent Name:Ormosanine
COMMENT: PRIME in-house No.:V0309
COMMENT: SubCategory_DNP: Alkaloids derived from lysine, More complex lysine-derived alkaloids, Ormosia alkaloids

CH$NAME: 1-((2R)(2-piperidyl))(1S,10S,2R)-3,15-diazatetracyclo(7.7.1.0(2,7).0(10,15))heptadecane
CH$NAME: Ormosanine
CH$COMPOUND_CLASS: Alkaloids
CH$FORMULA: C20H35N3
CH$EXACT_MASS: 317.5221
CH$SMILES: C1CCC([C@@]23CC(CC4CCCN[C@H]42)[C@@H]2CCCCN2C3)NC1
CH$IUPAC: InChI=1S/C20H35N3/c1-3-9-21-18(8-1)20-13-16(12-15-6-5-10-22-19(15)20)17-7-2-4-11-23(17)14-20/h15-19,21-22H,1-14H2/t15?,16?,17-,18?,19+,20-/m0/s1
CH$LINK: CAS 5001-21-8
CH$LINK: CHEMSPIDER 391262 13183720
CH$LINK: INCHIKEY YUKCLPPRYNXRAF-GYKGFCEISA-N

AC$INSTRUMENT: ABSciex API3200 LC/MS system
AC$INSTRUMENT_TYPE: LC-ESI-QQQ
AC$MASS_SPECTROMETRY: MS_TYPE MS
AC$MASS_SPECTROMETRY: ION_MODE POSITIVE

MS$FOCUSED_ION: PRECURSOR_TYPE [M+H]+

PK$SPLASH: splash10-0a4i-0913000000-1a74830cc2d6a96ee0e8
PK$NUM_PEAK: 136
PK$PEAK: m/z int. rel.int.
  100.4000 16758.7891 38
  100.7000 77641.9531 181
  100.8000 77808.6406 181
  100.9000 144177.0156 337
  101.0000 84521.2188 197
  101.1000 70656.5703 164
  101.2000 61049.8867 142
  101.3000 41927.2109 97
  101.4000 44048.6250 102
  101.7000 22228.8613 51
  110.8000 9379.4561 21
  114.9000 35260.0898 81
  115.0000 39790.7227 92
  115.1000 11955.4072 27
  115.2000 16122.3652 36
  119.0000 28517.1875 65
  120.0000 19819.6406 45
  120.1000 24668.4277 56
  132.4000 16713.3164 38
  132.7000 12803.9453 29
  134.5000 14319.2168 32
  134.7000 24213.8633 55
  135.9000 16137.5156 36
  141.7000 14849.5557 33
  148.7000 16001.1523 36
  149.1000 40214.9922 93
  150.7000 14001.0000 31
  150.9000 12591.8066 28
  151.0000 12182.6885 27
  151.2000 17031.5215 38
  151.3000 12940.3213 29
  151.4000 12773.6406 28
  151.5000 17213.3477 39
  159.0000 142676.8438 333
  159.1000 261352.0469 612
  159.2000 377708.7813 885
  159.3000 377163.3438 884
  159.4000 400134.6875 938
  159.5000 384133.5000 900
  159.6000 426060.7500 999
  159.7000 416666.1250 976
  159.8000 401316.5938 940
  159.9000 362041.0625 848
  160.0000 287141.7500 672
  160.1000 153571.5781 359
  160.2000 103007.3516 240
  160.3000 121826.8984 284
  160.4000 104052.8906 243
  160.5000 48776.2109 113
  160.6000 14107.0684 32
  160.7000 11622.0420 26
  179.6000 18137.6582 41
  179.7000 18577.0879 42
  179.8000 21804.5879 50
  179.9000 28532.3398 65
  180.0000 18713.4551 42
  180.1000 17834.6055 40
  180.2000 29759.7051 68
  180.3000 18910.4453 43
  180.4000 13182.7627 29
  180.5000 13379.7451 30
  180.6000 15531.4141 35
  198.0000 11909.9404 26
  198.7000 9394.6104 21
  198.8000 25123.0059 57
  199.3000 15698.0898 35
  206.5000 26638.2773 61
  206.9000 31668.9258 73
  207.3000 9788.5801 21
  214.1000 10212.8486 22
  217.6000 10182.5488 22
  217.8000 12713.0303 28
  217.9000 16940.6035 38
  218.3000 12243.2998 27
  218.5000 16667.8574 38
  220.4000 13455.5146 30
  220.5000 85081.8438 198
  220.6000 22274.3516 51
  220.8000 18774.1523 43
  221.1000 60989.2461 142
  221.4000 16925.4277 38
  221.5000 42230.3125 98
  222.1000 17380.0352 39
  222.4000 12258.4551 27
  222.5000 9894.6465 22
  223.2000 11834.1807 26
  234.6000 15076.8340 34
  234.7000 27865.6328 64
  234.8000 39169.4688 90
  234.9000 45730.5508 106
  235.0000 42851.5430 99
  235.1000 75702.3672 176
  235.2000 59534.5586 138
  235.3000 29759.6992 68
  235.4000 50276.3203 117
  235.5000 33093.2734 76
  235.6000 19274.1035 44
  235.7000 9561.2900 21
  238.6000 32184.1152 74
  238.7000 14288.8965 32
  238.9000 14546.5098 33
  239.0000 20137.8535 46
  239.1000 14637.4014 33
  239.2000 10576.5313 23
  239.4000 16864.8535 38
  301.1000 15652.6348 35
  301.2000 14879.8516 33
  310.6000 34866.1406 80
  311.0000 16834.5547 38
  311.1000 17925.5742 41
  312.3000 11667.5000 26
  312.7000 13804.0283 31
  317.6000 46306.3359 107
  317.7000 115493.0938 270
  317.8000 130463.8672 305
  317.9000 151571.4219 354
  318.0000 154692.8750 362
  318.1000 171709.2656 402
  318.2000 170027.2969 398
  318.3000 156662.7031 366
  318.4000 133358.0156 312
  318.5000 124372.5234 290
  318.6000 93143.0156 217
  318.7000 50927.8828 118
  318.8000 45533.5547 105
  318.9000 38260.3086 88
  319.0000 41745.4063 96
  319.1000 43897.0781 102
  319.2000 33441.7773 77
  319.3000 38396.6875 89
  319.4000 32532.6250 75
  319.5000 20910.5859 48
  319.6000 20607.5332 47
  319.7000 10288.6143 23
  320.2000 10818.9541 24
  433.1000 14152.5234 32