ACCESSION: MSBNK-RIKEN_NPDepo-CB000099
RECORD_TITLE: Tetrahydropalmatine; LC-ESI-QQQ; MS; [M+H]+
DATE: 2018.04.04
AUTHORS: Nogawa T, Okano A, CSRS, RIKEN
LICENSE: CC BY
COMMENT: Origin: Plant
COMMENT: SubCategory_DNP: Isoquinoline alkaloids, Benzylisoquinoline alkaloids

CH$NAME: Tetrahydropalmatine
CH$COMPOUND_CLASS: Alkaloids
CH$FORMULA: C21H25NO4
CH$EXACT_MASS: 355.4377
CH$SMILES: COc1cc2c(cc1OC)[C@H]1Cc3ccc(OC)c(OC)c3CN1CC2
CH$IUPAC: InChI=1S/C21H25NO4/c1-23-18-6-5-13-9-17-15-11-20(25-3)19(24-2)10-14(15)7-8-22(17)12-16(13)21(18)26-4/h5-6,10-11,17H,7-9,12H2,1-4H3/t17-/m1/s1
CH$LINK: CAS 10097-84-4
CH$LINK: CHEMSPIDER 65252
CH$LINK: INCHIKEY AEQDJSLRWYMAQI-QGZVFWFLSA-N
CH$LINK: COMPTOX DTXSID80359548
CH$LINK: PUBCHEM CID:969488

AC$INSTRUMENT: ABSciex API3200 LC/MS system
AC$INSTRUMENT_TYPE: LC-ESI-QQQ
AC$MASS_SPECTROMETRY: MS_TYPE MS
AC$MASS_SPECTROMETRY: ION_MODE POSITIVE

MS$FOCUSED_ION: PRECURSOR_TYPE [M+H]+

PK$SPLASH: splash10-0a4i-0409000000-3b8cdfef5b4cd734fc1a
PK$NUM_PEAK: 107
PK$PEAK: m/z int. rel.int.
  149.8000 262398.0625 21
  164.4000 709705.9375 60
  164.5000 1120562.8750 96
  164.6000 1949035.7500 168
  164.7000 1911016.0000 165
  164.8000 1657428.7500 142
  164.9000 1940707.8750 167
  165.0000 1851873.8750 159
  165.1000 1700397.5000 146
  165.2000 1610960.1250 138
  165.3000 1353993.2500 116
  165.4000 1219414.7500 104
  165.5000 540124.8125 45
  165.8000 267105.3125 22
  165.9000 486896.8750 41
  175.6000 264329.2500 21
  175.7000 333368.7188 27
  175.9000 297400.5625 24
  176.0000 308384.0938 25
  176.5000 339282.8438 28
  176.6000 399028.5000 33
  176.7000 386958.6875 32
  176.8000 464688.4063 39
  176.9000 423651.0000 35
  177.0000 602043.1250 51
  177.1000 310315.3125 25
  177.2000 335420.5313 28
  177.3000 304642.4375 25
  177.4000 278450.9688 23
  189.5000 338679.3750 28
  189.6000 298728.2500 24
  189.7000 466619.5313 39
  189.8000 422806.0938 35
  189.9000 406632.5313 34
  190.0000 450325.3125 38
  190.1000 326971.6875 27
  190.2000 354973.6563 29
  191.4000 2250902.5000 194
  191.5000 4701439.0000 407
  191.6000 6125317.0000 531
  191.7000 6900079.5000 598
  191.8000 7028020.0000 609
  191.9000 6384578.0000 553
  192.0000 6636113.0000 575
  192.1000 6261223.5000 542
  192.2000 5710235.5000 495
  192.3000 5603176.5000 485
  192.4000 7823904.5000 678
  192.5000 4958406.0000 429
  192.6000 1052247.7500 90
  192.7000 893891.5000 76
  192.8000 733000.6875 62
  192.9000 826541.8750 70
  193.0000 914530.8750 78
  193.1000 922738.4375 79
  193.2000 1524540.0000 131
  193.3000 1513797.8750 130
  193.4000 627510.3750 53
  193.5000 372837.0313 31
  353.4000 376457.8750 31
  353.5000 563178.1875 47
  353.6000 716223.5625 61
  353.7000 833904.5000 71
  353.8000 818092.9375 70
  353.9000 902943.9375 77
  354.0000 942050.1250 80
  354.1000 844042.9375 72
  354.2000 803488.5000 68
  354.3000 842353.3125 72
  354.4000 661788.7500 56
  354.5000 343748.7188 28
  354.6000 295348.7188 24
  355.2000 630286.4375 53
  355.3000 3044010.7500 263
  355.4000 8204586.0000 711
  355.5000 10722714.0000 930
  355.6000 10674557.0000 926
  355.7000 11345156.0000 984
  355.8000 11124396.0000 965
  355.9000 11440629.0000 992
  356.0000 11440145.0000 992
  356.1000 11511840.0000 999
  356.2000 11372793.0000 986
  356.3000 10851740.0000 941
  356.4000 10311132.0000 894
  356.5000 8304766.0000 720
  356.6000 6174683.0000 535
  356.7000 6031775.0000 522
  356.8000 6350782.0000 550
  356.9000 6285000.5000 544
  357.0000 5724600.5000 496
  357.1000 5596779.5000 485
  357.2000 5572398.0000 483
  357.3000 5107589.5000 442
  357.4000 4820448.0000 417
  357.5000 2498333.7500 216
  357.6000 1957726.1250 169
  357.7000 1566784.3750 135
  357.8000 1600700.5000 138
  357.9000 1086767.3750 93
  358.0000 1514521.8750 130
  358.1000 1594182.8750 137
  358.2000 1559904.6250 134
  358.3000 1505952.3750 129
  358.4000 1221949.5000 105
  358.5000 491362.7813 41
  358.6000 264208.5625 21