ACCESSION: MSBNK-RIKEN_NPDepo-CB000118
RECORD_TITLE: Sinomenine; LC-ESI-QQQ; MS; [M+H]+
DATE: 2018.04.04
AUTHORS: Nogawa T, Okano A, CSRS, RIKEN
LICENSE: CC BY
COMMENT: Origin: Plant
COMMENT: Formula(Parent): C19H23NO4
COMMENT: Bottle Name:Sinomenine
COMMENT: PRIME Parent Name:Sinomenine
COMMENT: PRIME in-house No.:V0298
COMMENT: SubCategory_DNP: Isoquinoline alkaloids, Morphine alkaloids

CH$NAME: Kukoline
CH$NAME: Cocculine
CH$NAME: Cucoline
CH$NAME: 4-Hydroxy-3,7-dimethoxy-17-methylmorphin-7-en-6-one
CH$NAME: Sinomenine
CH$COMPOUND_CLASS: Alkaloids
CH$FORMULA: C19H23NO4
CH$EXACT_MASS: 329.3995
CH$SMILES: COC1=C[C@@H]2[C@@H]3Cc4ccc(OC)c(O)c4[C@]2(CCN3C)CC1=O
CH$IUPAC: InChI=1S/C19H23NO4/c1-20-7-6-19-10-14(21)16(24-3)9-12(19)13(20)8-11-4-5-15(23-2)18(22)17(11)19/h4-5,9,12-13,22H,6-8,10H2,1-3H3/t12-,13+,19-/m1/s1
CH$LINK: CAS 115-53-7
CH$LINK: CHEMSPIDER 10179905
CH$LINK: INCHIKEY INYYVPJSBIVGPH-QHRIQVFBSA-N
CH$LINK: PUBCHEM CID:5459308

AC$INSTRUMENT: ABSciex API3200 LC/MS system
AC$INSTRUMENT_TYPE: LC-ESI-QQQ
AC$MASS_SPECTROMETRY: MS_TYPE MS
AC$MASS_SPECTROMETRY: ION_MODE POSITIVE

MS$FOCUSED_ION: PRECURSOR_TYPE [M+H]+

PK$SPLASH: splash10-0059-0019000000-7eea0859fc100167cdd4
PK$NUM_PEAK: 94
PK$PEAK: m/z int. rel.int.
  101.2000 160101.3750 26
  101.3000 168922.0469 28
  180.6000 151140.7813 25
  180.7000 140220.0000 23
  180.8000 171162.2031 28
  180.9000 201544.3750 34
  181.0000 171652.2500 28
  181.1000 175292.5313 29
  181.2000 164791.7813 27
  194.8000 138609.9063 23
  206.7000 129579.2344 21
  206.8000 173752.3750 29
  207.0000 126779.0313 21
  207.1000 127969.1328 21
  208.6000 128319.1250 21
  209.3000 205674.6875 34
  212.6000 172492.3281 29
  212.7000 159261.3594 26
  212.8000 139869.9688 23
  213.0000 152610.8750 25
  213.2000 134829.6094 22
  222.5000 172842.3125 29
  222.6000 179002.7656 30
  222.7000 213235.2031 36
  222.8000 240677.1406 40
  222.9000 197834.1250 33
  223.0000 185653.2344 31
  223.1000 157231.2344 26
  223.2000 269379.2500 45
  223.3000 168852.0313 28
  223.4000 164231.6875 27
  238.4000 281070.0625 47
  238.5000 277639.7813 47
  238.6000 245507.5156 41
  238.7000 206864.7656 35
  238.8000 259578.5000 44
  238.9000 221565.7813 37
  239.0000 202524.4531 34
  239.1000 228986.3125 38
  239.2000 188873.4531 31
  239.3000 297241.2188 50
  239.4000 183973.1094 31
  240.4000 135319.6719 22
  240.5000 146590.4531 24
  240.6000 156531.1563 26
  240.7000 173962.4375 29
  240.8000 209104.9219 35
  240.9000 189573.5469 32
  241.0000 178302.7188 30
  241.1000 186563.3281 31
  241.2000 185023.1875 31
  241.3000 172282.2969 29
  254.6000 175502.5156 29
  254.7000 153730.9531 25
  254.8000 151980.8438 25
  254.9000 178862.7344 30
  255.0000 177252.6563 29
  255.1000 161991.5469 27
  255.2000 160591.4531 26
  255.3000 137839.8281 23
  255.4000 131189.3594 21
  329.3000 230246.4375 39
  329.4000 1496706.5000 259
  329.5000 3764938.5000 654
  329.6000 5254435.0000 914
  329.7000 5389544.5000 937
  329.8000 5411246.0000 941
  329.9000 5340540.5000 929
  330.0000 5320380.0000 925
  330.1000 5740759.0000 999
  330.2000 5148377.0000 895
  330.3000 4073380.7500 708
  330.4000 3561293.2500 619
  330.5000 2420352.7500 420
  330.6000 1869763.2500 324
  330.7000 2069487.7500 359
  330.8000 2566383.0000 446
  330.9000 2353427.7500 408
  331.0000 2066967.6250 359
  331.1000 2006272.7500 348
  331.2000 1965040.1250 341
  331.3000 1907215.3750 331
  331.4000 1695590.8750 294
  331.5000 1022982.7500 177
  331.6000 718321.1875 124
  331.7000 518876.9063 89
  331.8000 924065.8750 159
  331.9000 413869.5625 71
  332.0000 367946.2500 63
  332.1000 413029.4688 70
  332.2000 345614.5938 59
  332.3000 376276.8125 64
  332.4000 336654.0000 57
  332.5000 133429.5156 22