ACCESSION: MSBNK-RIKEN_NPDepo-CB000341
RECORD_TITLE: Zearalenone; LC-ESI-QQQ; MS; [M+H]+
DATE: 2018.04.04
AUTHORS: Nogawa T, Okano A, CSRS, RIKEN
LICENSE: CC BY
COMMENT: Origin: Microbe
COMMENT: Formula(Parent): C18H22O5
COMMENT: Bottle Name:zearalenone
COMMENT: PRIME Parent Name:Zearalenone
COMMENT: PRIME in-house No.:V0033

CH$NAME: FES
CH$NAME: Fusarium toxin
CH$NAME: Mycotoxin F2
CH$NAME: Benzoxacyclotetradecin-1,7(8H)-dione
CH$NAME: Zenone
CH$NAME: 6-(10-Hydroxy-6-oxo-trans-1-undecenyl)-beta-resorcylic acid-N-lactone
CH$NAME: Zearalenone
CH$COMPOUND_CLASS: Polyketides
CH$FORMULA: C18H22O5
CH$EXACT_MASS: 318.373
CH$SMILES: C[C@H]1CCCC(=O)CCC/C=C/c2cc(O)cc(O)c2C(=O)O1
CH$IUPAC: InChI=1S/C18H22O5/c1-12-6-5-9-14(19)8-4-2-3-7-13-10-15(20)11-16(21)17(13)18(22)23-12/h3,7,10-12,20-21H,2,4-6,8-9H2,1H3/b7-3+/t12-/m0/s1
CH$LINK: CAS 17924-92-4
CH$LINK: CHEMSPIDER 4444897
CH$LINK: INCHIKEY MBMQEIFVQACCCH-QBODLPLBSA-N
CH$LINK: COMPTOX DTXSID0021460
CH$LINK: PUBCHEM CID:5281576

AC$INSTRUMENT: ABSciex API3200 LC/MS system
AC$INSTRUMENT_TYPE: LC-ESI-QQQ
AC$MASS_SPECTROMETRY: MS_TYPE MS
AC$MASS_SPECTROMETRY: ION_MODE POSITIVE

MS$FOCUSED_ION: PRECURSOR_TYPE [M+H]+

PK$SPLASH: splash10-014i-0297000000-53bb5ad5f941da2d5d88
PK$NUM_PEAK: 378
PK$PEAK: m/z int. rel.int.
  100.0000 371804.3750 257
  100.5000 47966.3984 32
  100.6000 39539.8438 26
  100.7000 47577.4570 32
  118.5000 36039.6055 24
  122.6000 44206.8555 29
  122.7000 47966.3906 32
  124.6000 45114.3281 30
  125.3000 59244.9688 40
  125.5000 54189.0547 36
  130.9000 32409.7227 21
  131.0000 38632.3906 25
  131.1000 32798.6406 21
  133.0000 38632.3906 25
  133.4000 37465.6328 25
  134.9000 33835.7461 22
  135.1000 34224.6680 22
  142.9000 32669.0000 21
  143.2000 45892.1680 30
  147.0000 32280.0840 21
  148.4000 38891.6641 26
  148.5000 47318.2070 31
  148.7000 132879.8438 91
  148.9000 52633.3789 35
  149.1000 45892.1563 30
  149.2000 49003.5000 33
  149.3000 36558.1836 24
  156.5000 38243.4727 25
  156.7000 38502.7500 25
  156.8000 72727.3984 49
  157.0000 38373.1094 25
  157.2000 37724.9180 25
  160.6000 46929.2734 31
  160.7000 53540.8594 36
  160.9000 32669.0000 21
  161.5000 32928.2773 21
  162.9000 78301.8906 53
  163.3000 31761.5273 21
  164.5000 39410.2188 26
  164.6000 47318.1875 31
  164.7000 31761.5273 21
  164.8000 60022.8008 40
  164.9000 87246.9688 59
  165.1000 44725.4102 30
  165.2000 46281.0781 31
  168.5000 59893.1641 40
  168.6000 59633.8828 40
  168.7000 45762.5273 30
  168.8000 74412.7109 50
  168.9000 38502.7500 25
  169.0000 37984.1953 25
  169.1000 53281.5820 36
  169.4000 46410.7188 31
  172.6000 126008.9922 86
  172.7000 36298.8906 24
  174.5000 32020.8047 21
  174.6000 38632.3906 25
  174.8000 73634.8828 50
  175.0000 59893.1641 40
  175.1000 38762.0273 25
  175.3000 39669.5000 26
  175.4000 32409.7227 21
  176.6000 37724.9180 25
  176.7000 52503.7500 35
  176.8000 32020.8086 21
  176.9000 53022.3047 35
  177.2000 41484.4453 27
  184.6000 52763.0273 35
  184.7000 73505.2422 50
  184.8000 87376.6016 59
  184.9000 60282.0781 40
  185.0000 124582.9688 85
  185.1000 61319.1914 41
  185.2000 88673.0000 60
  185.3000 60930.2734 41
  185.4000 74801.6328 50
  185.6000 39928.7773 26
  185.7000 54707.6094 37
  186.4000 68060.4141 46
  186.5000 144417.7031 99
  186.6000 185124.3125 127
  186.7000 157640.8750 108
  186.8000 233738.9219 161
  186.9000 261611.2656 180
  187.0000 310485.1250 214
  187.1000 219608.2656 151
  187.2000 141824.9219 97
  187.3000 143380.5938 98
  187.4000 109285.5781 74
  187.5000 117063.9063 80
  187.6000 39799.1367 26
  187.7000 39669.5000 26
  187.9000 33317.1953 22
  188.1000 33057.9141 21
  188.2000 40317.6914 27
  188.3000 74412.7109 50
  188.4000 54318.6914 36
  188.5000 60152.4414 40
  188.6000 46540.3555 31
  188.7000 46799.6328 31
  188.9000 52763.0273 35
  189.0000 95414.2109 65
  189.1000 59893.1641 40
  189.3000 38632.3906 25
  189.4000 45114.3281 30
  190.5000 33187.5547 22
  196.6000 32020.8047 21
  200.6000 45373.6016 30
  200.7000 45373.6016 30
  200.8000 38373.1094 25
  201.2000 37984.1953 25
  201.4000 38762.0273 25
  202.4000 54318.6914 36
  202.5000 74931.2656 51
  202.6000 74801.6328 50
  202.7000 151547.8438 104
  202.8000 74542.3516 50
  202.9000 60022.8008 40
  203.0000 53670.4961 36
  203.1000 33317.1953 22
  203.2000 67541.8594 45
  203.3000 82061.4219 56
  203.4000 222330.6719 153
  204.4000 32280.0840 21
  204.5000 39928.7773 26
  204.6000 46281.0781 31
  204.7000 32150.4414 21
  204.8000 59244.9688 40
  204.9000 38502.7500 25
  205.0000 54189.0547 36
  205.1000 52503.7500 35
  205.2000 60541.3516 41
  212.5000 54318.6914 36
  212.6000 96321.6875 65
  212.7000 60282.0781 40
  212.8000 109674.5000 75
  212.9000 95932.7656 65
  213.0000 74931.2656 51
  213.1000 109933.7813 75
  213.2000 68967.8906 46
  213.3000 75190.5391 51
  213.4000 38762.0273 25
  214.1000 35261.7734 23
  214.4000 64171.2461 43
  214.5000 45243.9648 30
  214.6000 115897.1641 79
  214.7000 88024.8047 60
  214.9000 109415.2188 75
  215.0000 108637.3828 74
  215.1000 73894.1563 50
  215.2000 88284.0781 60
  215.3000 66375.1094 45
  215.4000 53411.2227 36
  215.5000 47577.4688 32
  215.9000 40576.9766 27
  216.0000 41225.1680 27
  216.2000 40965.8906 27
  216.4000 52503.7500 35
  216.5000 98266.2891 67
  216.6000 63004.4961 42
  216.7000 67801.1328 46
  216.8000 61578.4688 41
  216.9000 136380.0938 93
  217.0000 180327.7031 124
  217.1000 129898.1641 89
  217.2000 109415.2344 75
  217.3000 117971.3750 81
  217.4000 70264.2734 47
  217.8000 32669.0000 21
  221.3000 48484.9375 32
  224.7000 34743.2266 23
  226.0000 32539.3594 21
  226.6000 37595.2734 25
  226.7000 51855.5508 35
  226.9000 60282.0781 40
  227.0000 64949.0820 44
  227.2000 35521.0547 23
  227.3000 31761.5273 21
  227.4000 33057.9141 21
  228.4000 46669.9961 31
  228.5000 32928.2773 21
  228.6000 61189.5469 41
  228.7000 88413.7188 60
  228.8000 75579.4531 51
  228.9000 117323.1953 80
  229.0000 80765.0313 55
  229.1000 32669.0000 21
  229.2000 82191.0469 56
  229.3000 81802.1484 55
  229.4000 60541.3516 41
  230.3000 34743.2227 23
  230.4000 110322.7031 75
  230.5000 96580.9609 66
  230.6000 158677.9844 109
  230.7000 166456.3281 114
  230.8000 151677.4688 104
  230.9000 179420.2344 123
  231.0000 149214.3438 102
  231.1000 159066.9063 109
  231.2000 136639.3906 93
  231.3000 109933.7813 75
  231.4000 95414.2109 65
  231.5000 34354.3047 22
  231.6000 54318.6914 36
  232.2000 47318.1875 31
  232.5000 38891.6680 26
  236.4000 69097.5313 47
  240.6000 37206.3594 24
  240.7000 39021.3047 26
  240.8000 45892.1641 30
  240.9000 78950.0859 53
  241.0000 43947.5781 29
  241.1000 66504.7500 45
  241.2000 58985.6875 40
  241.3000 71949.5781 49
  241.8000 40188.0508 26
  242.3000 41354.8086 27
  243.2000 61319.1914 41
  244.5000 33576.4766 22
  244.7000 33057.9141 21
  246.8000 54966.8906 37
  248.4000 44855.0508 30
  248.5000 39539.8594 26
  248.6000 39669.5000 26
  248.7000 94636.3750 64
  248.8000 38243.4727 25
  248.9000 67541.8594 45
  249.0000 81802.1484 55
  249.1000 46929.2734 31
  249.2000 67152.9531 45
  249.3000 46410.7188 31
  249.4000 46021.8008 30
  249.6000 52633.3867 35
  249.8000 32150.4414 21
  250.2000 46929.2734 31
  250.4000 32798.6367 21
  254.4000 40706.6094 27
  254.5000 54318.6914 36
  254.6000 130546.3594 89
  254.7000 109674.5000 75
  254.8000 32280.0840 21
  254.9000 86728.4063 59
  255.0000 116026.8047 79
  255.1000 109026.3047 74
  255.2000 74412.7109 50
  255.3000 87635.8828 59
  255.4000 75320.1875 51
  255.5000 68449.3359 46
  256.4000 40447.3320 27
  256.6000 68319.6953 46
  256.7000 53800.1367 36
  256.8000 39799.1367 26
  256.9000 33446.8320 22
  257.0000 102803.6484 70
  257.1000 47836.7461 32
  257.3000 53670.4961 36
  257.4000 89710.1172 61
  257.6000 34095.0273 22
  258.3000 55226.1680 37
  258.4000 33706.1094 22
  258.5000 33576.4766 22
  258.8000 32280.0840 21
  258.9000 33187.5547 22
  259.0000 40058.4180 26
  259.3000 60930.2734 41
  261.4000 35002.5000 23
  264.4000 47188.5508 31
  264.5000 60670.9961 41
  264.6000 123156.9219 84
  264.7000 109804.1328 75
  264.8000 173067.9219 119
  264.9000 117063.9063 80
  265.0000 109026.3047 74
  265.1000 123416.2109 84
  265.2000 124323.6953 85
  265.3000 138324.6875 95
  265.4000 123675.5000 84
  265.5000 47707.1055 32
  265.6000 54577.9688 36
  265.8000 41095.5234 27
  265.9000 33576.4766 22
  266.2000 55355.8008 37
  266.3000 40836.2461 27
  266.4000 33317.1953 22
  266.5000 39928.7773 26
  266.8000 82450.3359 56
  267.2000 54059.4180 36
  267.3000 40058.4180 26
  267.4000 33317.1953 22
  282.3000 47577.4688 32
  282.4000 312559.3750 216
  282.5000 644564.5000 447
  282.6000 812706.1875 563
  282.7000 917065.5000 636
  282.8000 851338.5625 590
  282.9000 844078.6875 585
  283.0000 846541.8125 587
  283.1000 784963.4375 544
  283.2000 987848.3125 685
  283.3000 581689.6250 403
  283.4000 583634.1250 404
  283.5000 353395.6875 244
  283.6000 347173.0000 240
  283.7000 208329.7031 143
  283.8000 206903.6875 142
  283.9000 270556.4063 187
  284.0000 130805.6328 89
  284.1000 108896.6563 74
  284.2000 137417.2188 94
  284.3000 108248.4609 74
  284.4000 144417.7031 99
  284.5000 52114.8320 35
  284.8000 31761.5273 21
  285.1000 32280.0840 21
  285.2000 32928.2773 21
  300.4000 88284.0781 60
  300.5000 276779.0313 191
  300.6000 309059.1250 213
  300.7000 513499.5938 355
  300.8000 435327.3438 301
  300.9000 624340.8750 432
  301.0000 539816.3750 374
  301.1000 532686.1875 369
  301.2000 524778.2500 363
  301.3000 442846.4063 306
  301.4000 422752.3438 292
  301.5000 214422.7031 148
  301.6000 319689.4688 221
  301.7000 132231.6563 90
  301.8000 96710.6016 66
  301.9000 82320.6953 56
  302.0000 103581.4766 71
  302.1000 82709.6172 56
  302.2000 81283.5781 55
  302.3000 89191.5469 60
  302.4000 89450.8359 61
  302.5000 33446.8320 22
  302.9000 48873.8516 32
  303.1000 41484.4453 27
  318.3000 96969.8906 66
  318.4000 339653.8750 235
  318.5000 803631.5625 557
  318.6000 1088966.6250 755
  318.7000 1234680.7500 857
  318.8000 1282128.5000 890
  318.9000 1130969.5000 785
  319.0000 1129543.5000 784
  319.1000 1121635.6250 778
  319.2000 1438602.7500 999
  319.3000 823207.0000 571
  319.4000 730126.1875 506
  319.5000 422622.6875 292
  319.6000 290650.3438 201
  319.7000 254999.6719 176
  319.8000 284298.0625 196
  319.9000 171641.8906 118
  320.0000 221682.5000 153
  320.1000 173067.9219 119
  320.2000 158418.7031 109
  320.3000 179809.1406 123
  320.4000 200680.9844 138
  320.5000 82320.6953 56
  320.6000 62485.9375 42
  320.7000 33446.8320 22
  320.8000 41354.8086 27
  320.9000 40965.8906 27
  321.1000 48355.3008 32
  321.4000 32409.7227 21
  336.1000 68708.6094 46
  336.2000 33576.4766 22
  359.5000 41873.3594 28
  359.8000 41873.3594 28
  360.0000 34224.6680 22
  636.6000 63004.4961 42
  636.7000 35002.5000 23
  636.8000 41743.7227 28
  636.9000 34613.5820 23
  637.1000 42003.0000 28