ACCESSION: MSBNK-RIKEN_NPDepo-CB000383
RECORD_TITLE: Solanidine; LC-ESI-QQQ; MS; [M+H]+
DATE: 2018.04.04
AUTHORS: Nogawa T, Okano A, CSRS, RIKEN
LICENSE: CC BY
COMMENT: Origin: Plant
COMMENT: Formula(Parent): C27H43NO
COMMENT: Bottle Name:Solanidine
COMMENT: PRIME Parent Name:Solanidine
COMMENT: PRIME in-house No.:S0346
COMMENT: SubCategory_DNP: The sterols, Cholestanes

CH$NAME: Solanidin
CH$NAME: Solatubine
CH$NAME: Solatubin
CH$NAME: Solanid-5-en-3beta-ol
CH$NAME: 22R,25S-Solanidanine
CH$NAME: Solanidine
CH$COMPOUND_CLASS: Steroids
CH$FORMULA: C27H43NO
CH$EXACT_MASS: 397.6499
CH$SMILES: C[C@H]1CCC2[C@@H](C)[C@H]3[C@H](CC4[C@@H]5CC=C6CC(O)CC[C@]6(C)[C@H]5CC[C@@]43C)N2C1
CH$IUPAC: InChI=1S/C27H43NO/c1-16-5-8-23-17(2)25-24(28(23)15-16)14-22-20-7-6-18-13-19(29)9-11-26(18,3)21(20)10-12-27(22,25)4/h6,16-17,19-25,29H,5,7-15H2,1-4H3/t16-,17+,19?,20+,21-,22?,23?,24-,25-,26-,27-/m0/s1
CH$LINK: CAS 80-78-4
CH$LINK: CHEMSPIDER 59150 455985
CH$LINK: INCHIKEY JVKYZPBMZPJNAJ-XGNLVQFCSA-N

AC$INSTRUMENT: ABSciex API3200 LC/MS system
AC$INSTRUMENT_TYPE: LC-ESI-QQQ
AC$MASS_SPECTROMETRY: MS_TYPE MS
AC$MASS_SPECTROMETRY: ION_MODE POSITIVE

MS$FOCUSED_ION: PRECURSOR_TYPE [M+H]+

PK$SPLASH: splash10-0002-0009000000-6ad169d41588ca03dae6
PK$NUM_PEAK: 71
PK$PEAK: m/z int. rel.int.
  395.7000 260970.1250 22
  395.8000 284835.4688 24
  395.9000 298963.7188 25
  396.0000 334772.3438 29
  396.1000 429639.7188 37
  396.2000 312795.0000 27
  396.3000 291241.9688 25
  396.4000 269519.2188 23
  396.5000 290647.9375 25
  397.4000 1027524.8750 91
  397.5000 4445847.5000 398
  397.6000 8921988.0000 801
  397.7000 10024629.0000 900
  397.8000 10352741.0000 930
  397.9000 10572049.0000 949
  398.0000 10476968.0000 941
  398.1000 10861489.0000 975
  398.2000 11118277.0000 999
  398.3000 10841376.0000 974
  398.4000 10277920.0000 923
  398.5000 9951125.0000 894
  398.6000 7712620.5000 692
  398.7000 6275883.5000 563
  398.8000 6302803.5000 565
  398.9000 6665874.5000 598
  399.0000 6394043.5000 574
  399.1000 6456284.5000 579
  399.2000 6579832.0000 590
  399.3000 6395338.5000 574
  399.4000 6222637.5000 558
  399.5000 5993890.5000 538
  399.6000 4142089.2500 371
  399.7000 2386109.7500 213
  399.8000 1965400.6250 175
  399.9000 1851525.8750 165
  400.0000 1830927.3750 163
  400.1000 1802840.5000 161
  400.2000 1946647.7500 174
  400.3000 2069814.2500 185
  400.4000 1889710.3750 168
  400.5000 1532154.6250 136
  400.6000 785604.5625 69
  400.7000 379533.0625 33
  400.8000 325077.6875 28
  400.9000 258721.4531 22
  830.7000 303100.3750 26
  830.8000 400980.1250 35
  830.9000 465151.3438 40
  831.0000 564452.3125 49
  831.1000 522449.4375 45
  831.2000 527243.5625 46
  831.3000 565364.5625 49
  831.4000 549284.5625 48
  831.5000 485367.9063 42
  831.6000 435982.6250 38
  831.7000 343427.5313 29
  831.8000 298433.3750 25
  831.9000 286893.1875 24
  832.0000 324229.1250 28
  832.1000 342642.5938 29
  832.2000 354564.6250 30
  832.3000 340690.9688 29
  832.4000 384645.6250 33
  832.5000 289099.4063 25
  832.6000 277177.3125 23
  832.7000 257597.1406 22
  833.0000 255518.2031 21
  833.1000 267843.3438 23
  833.2000 280804.8750 24
  833.3000 308806.8438 26
  833.4000 265509.8438 22