ACCESSION: MSBNK-PFOS_research_group-FFF00184
RECORD_TITLE: Epiandrosterone; LC-APPI-QQ; MS2; CE:20 V; [M-H2O+H]+
DATE: 2016.01.19 (Created 2011.04.05, modified 2011.06.20)
AUTHORS: Atsushi Yamamoto, PFOS.jp
LICENSE: CC BY-SA
COPYRIGHT: PFOS.jp
COMMENT: Disclaimer: While authors make an effort to ensure that the content of this record is accurate, the authors make no representations or warranties in relation to the accuracy or completeness of the record. This record do not reflect any viewpoints of the affiliation and organization to which the authors belong.

CH$NAME: Epiandrosterone
CH$NAME: 3-beta-Hydroxy-5alpha-androstan-17-one
CH$COMPOUND_CLASS: Natural Product; Steroid hormone
CH$FORMULA: C19H30O2
CH$EXACT_MASS: 290.22458
CH$SMILES: OC(C4)CC([H])(C3)C(C)(C4)C(C2)C(C3)C(C1)C(C)(C2)C(=O)C1
CH$IUPAC: InChI=1S/C19H30O2/c1-18-9-7-13(20)11-12(18)3-4-14-15-5-6-17(21)19(15,2)10-8-16(14)18/h12-16,20H,3-11H2,1-2H3/t12-,13-,14?,15?,16?,18?,19?/m0/s1
CH$LINK: CAS 481-29-8
CH$LINK: LIPIDBANK SST0205
CH$LINK: INCHIKEY QGXBDMJGAMFCBF-CYFBJHQBSA-N

AC$INSTRUMENT: API2000
AC$INSTRUMENT_TYPE: LC-APPI-QQ
AC$MASS_SPECTROMETRY: MS_TYPE MS2
AC$MASS_SPECTROMETRY: ION_MODE POSITIVE
AC$CHROMATOGRAPHY: RETENTION_TIME 0.820833 min

MS$FOCUSED_ION: BASE_PEAK 273.200012
MS$FOCUSED_ION: PRECURSOR_M/Z 273.300000
MS$FOCUSED_ION: PRECURSOR_TYPE [M-H2O+H]+

PK$SPLASH: splash10-0ab9-0690000000-bc1a1f98b51aef8b82a9
PK$NUM_PEAK: 250
PK$PEAK: m/z int. rel.int.
  39.099998 1350.500000 1
  39.299999 1350.500000 1
  40.599998 1350.500000 1
  40.900002 1350.500000 1
  42.650000 2701.000000 1
  43.000000 2701.000000 1
  44.000000 2701.000000 1
  52.900002 1350.500000 1
  53.150000 2701.000000 1
  54.984615 17556.500000 1
  56.950001 2701.000000 1
  57.299999 1350.500000 1
  59.200001 1350.500000 1
  61.500000 1350.500000 1
  64.900002 1350.500000 1
  65.099998 2701.000000 1
  65.900002 1350.500000 1
  66.199997 1350.500000 1
  67.107408 72927.000000 3
  68.862502 10804.000000 1
  69.129998 13505.000000 1
  71.237499 10804.000000 1
  71.599998 1350.500000 1
  72.400002 1350.500000 1
  72.900002 1350.500000 1
  75.000000 1350.500000 1
  76.099998 1350.500000 1
  76.500000 2701.000000 1
  76.800003 12154.500000 1
  77.081249 21608.000000 1
  77.400002 4051.500000 1
  77.900002 2701.000000 1
  78.149998 8103.000000 1
  79.109373 86432.000000 3
  81.112797 453768.000000 18
  82.000000 5402.000000 1
  82.500000 9453.500000 1
  83.105000 162060.000000 7
  84.049999 2701.000000 1
  84.993182 118844.000000 5
  87.000000 2701.000000 1
  89.400002 1350.500000 1
  89.900002 2701.000000 1
  90.275002 5402.000000 1
  91.078846 140452.000000 6
  92.000000 6752.500000 1
  93.143062 282254.500000 11
  95.078000 405150.000000 16
  95.900002 5402.000000 1
  97.072580 167462.000000 7
  98.000000 2701.000000 1
  98.300003 2701.000000 1
  98.780002 13505.000000 1
  99.104761 28360.500000 1
  99.699997 1350.500000 1
  101.199997 2701.000000 1
  101.500000 1350.500000 1
  102.750000 2701.000000 1
  103.199997 2701.000000 1
  104.183331 8103.000000 1
  105.057062 478077.000000 19
  107.036731 1669218.000000 67
  108.062499 10804.000000 1
  109.060331 490231.500000 20
  110.149998 2701.000000 1
  110.400002 2701.000000 1
  111.090000 81030.000000 3
  112.549999 2701.000000 1
  113.124998 10804.000000 1
  113.500000 1350.500000 1
  114.099998 1350.500000 1
  114.800003 1350.500000 1
  115.000000 2701.000000 1
  115.649998 2701.000000 1
  116.149998 2701.000000 1
  116.985715 56721.000000 2
  117.306253 21608.000000 1
  118.099998 5402.000000 1
  119.078740 343027.000000 14
  119.900002 5402.000000 1
  121.117323 857567.500000 35
  121.775002 5402.000000 1
  123.044737 359233.000000 14
  124.000000 1350.500000 1
  124.300003 8103.000000 1
  125.191779 98586.500000 4
  126.800003 1350.500000 1
  127.049999 2701.000000 1
  128.025002 5402.000000 1
  128.399994 4051.500000 1
  128.600006 1350.500000 1
  128.899994 10804.000000 1
  129.199997 8103.000000 1
  129.600006 2701.000000 1
  129.800003 2701.000000 1
  131.180770 280904.000000 11
  132.100006 17556.500000 1
  133.142801 1022328.500000 41
  135.142043 1493653.000000 60
  136.000000 4051.500000 1
  137.097115 280904.000000 11
  138.349998 2701.000000 1
  138.874996 10804.000000 1
  139.162500 21608.000000 1
  140.600006 1350.500000 1
  140.800003 1350.500000 1
  141.000000 5402.000000 1
  141.250000 2701.000000 1
  142.025002 5402.000000 1
  142.300003 2701.000000 1
  142.500000 4051.500000 1
  143.078260 62123.000000 3
  144.100006 24309.000000 1
  145.105347 2020348.000000 82
  147.146296 5031963.000000 203
  148.199997 10804.000000 1
  149.176527 575313.000000 23
  150.337500 10804.000000 1
  151.140307 264698.000000 11
  152.000000 1350.500000 1
  152.600006 1350.500000 1
  153.150002 10804.000000 1
  154.300003 2701.000000 1
  154.699997 1350.500000 1
  154.899994 1350.500000 1
  155.200002 4051.500000 1
  155.600006 2701.000000 1
  155.899994 2701.000000 1
  156.100006 1350.500000 1
  157.037498 75628.000000 3
  159.124092 2601063.000000 105
  161.132477 7734313.500000 312
  163.160715 756280.000000 31
  164.100006 1350.500000 1
  165.306062 44566.500000 2
  166.500000 1350.500000 1
  167.500000 1350.500000 1
  168.000000 1350.500000 1
  168.300003 2701.000000 1
  168.800003 1350.500000 1
  169.199997 2701.000000 1
  170.000000 5402.000000 1
  171.085228 237688.000000 10
  171.800003 12154.500000 1
  173.191210 1874494.000000 76
  175.191061 966958.000000 39
  176.300000 6752.500000 1
  177.202857 283605.000000 11
  178.200002 4051.500000 1
  178.800003 8103.000000 1
  179.133334 16206.000000 1
  179.800003 1350.500000 1
  180.199997 1350.500000 1
  180.800003 1350.500000 1
  181.150002 16206.000000 1
  182.100006 1350.500000 1
  182.349998 5402.000000 1
  183.349998 10804.000000 1
  183.837500 10804.000000 1
  185.173639 1116863.500000 45
  185.899994 9453.500000 1
  186.275000 32412.000000 1
  187.163174 451067.000000 18
  188.000000 8103.000000 1
  189.241060 407851.000000 16
  190.250000 8103.000000 1
  191.169281 206626.500000 8
  192.100006 1350.500000 1
  193.300003 2701.000000 1
  194.800003 2701.000000 1
  195.000000 2701.000000 1
  195.300003 4051.500000 1
  195.899994 1350.500000 1
  196.899994 5402.000000 1
  197.400002 10804.000000 1
  199.202603 2802287.500000 113
  200.293333 40515.000000 2
  201.193181 594220.000000 24
  202.025002 5402.000000 1
  203.241807 478077.000000 19
  204.349998 2701.000000 1
  204.600006 1350.500000 1
  205.077781 12154.500000 1
  205.550003 5402.000000 1
  206.600006 1350.500000 1
  207.000000 1350.500000 1
  208.800003 1350.500000 1
  210.199997 1350.500000 1
  211.287502 10804.000000 1
  211.750000 2701.000000 1
  212.500000 14855.500000 1
  213.219722 1260016.500000 51
  215.225942 895381.500000 36
  216.100006 5402.000000 1
  216.300003 5402.000000 1
  217.200000 298460.500000 12
  218.100006 1350.500000 1
  218.899994 1350.500000 1
  222.500000 1350.500000 1
  224.000000 1350.500000 1
  225.100006 2701.000000 1
  225.500000 2701.000000 1
  225.883329 8103.000000 1
  226.309092 29711.000000 1
  227.251237 382191.500000 15
  228.050003 2701.000000 1
  228.300003 1350.500000 1
  229.071427 103988.500000 4
  230.100006 1350.500000 1
  230.399994 5402.000000 1
  230.859998 13505.000000 1
  231.199997 12154.500000 1
  231.416662 8103.000000 1
  236.100006 1350.500000 1
  237.100001 4051.500000 1
  237.500000 1350.500000 1
  238.399994 1350.500000 1
  239.399994 2701.000000 1
  239.699997 8103.000000 1
  240.270832 32412.000000 1
  241.200001 18907.000000 1
  242.399994 1350.500000 1
  243.050003 2701.000000 1
  243.300003 2701.000000 1
  243.600006 2701.000000 1
  244.000000 2701.000000 1
  244.600006 1350.500000 1
  245.269766 58071.500000 2
  245.600006 12154.500000 1
  245.800003 1350.500000 1
  248.000000 1350.500000 1
  248.199997 1350.500000 1
  251.899994 2701.000000 1
  252.100006 1350.500000 1
  253.246152 35113.000000 1
  253.600006 8103.000000 1
  255.316799 23394711.500000 944
  257.000000 2701.000000 1
  257.399994 4051.500000 1
  258.175011 10804.000000 1
  258.533335 24309.000000 1
  265.299988 1350.500000 1
  266.399994 1350.500000 1
  269.600006 1350.500000 1
  270.399994 5402.000000 1
  270.600006 1350.500000 1
  270.799988 4051.500000 1
  271.100006 1350.500000 1
  273.328248 24754665.000000 999
  275.000000 1350.500000 1