ACCESSION: MSBNK-PFOS_research_group-FFF00185
RECORD_TITLE: Epiandrosterone; LC-APPI-QQ; MS2; CE:10 V; [M-H2O+H]+
DATE: 2016.01.19 (Created 2011.04.05, modified 2011.06.20)
AUTHORS: Atsushi Yamamoto, PFOS.jp
LICENSE: CC BY-SA
COPYRIGHT: PFOS.jp
COMMENT: Disclaimer: While authors make an effort to ensure that the content of this record is accurate, the authors make no representations or warranties in relation to the accuracy or completeness of the record. This record do not reflect any viewpoints of the affiliation and organization to which the authors belong.

CH$NAME: Epiandrosterone
CH$NAME: 3-beta-Hydroxy-5alpha-androstan-17-one
CH$COMPOUND_CLASS: Natural Product; Steroid hormone
CH$FORMULA: C19H30O2
CH$EXACT_MASS: 290.22458
CH$SMILES: OC(C4)CC([H])(C3)C(C)(C4)C(C2)C(C3)C(C1)C(C)(C2)C(=O)C1
CH$IUPAC: InChI=1S/C19H30O2/c1-18-9-7-13(20)11-12(18)3-4-14-15-5-6-17(21)19(15,2)10-8-16(14)18/h12-16,20H,3-11H2,1-2H3/t12-,13-,14?,15?,16?,18?,19?/m0/s1
CH$LINK: CAS 481-29-8
CH$LINK: LIPIDBANK SST0205
CH$LINK: INCHIKEY QGXBDMJGAMFCBF-CYFBJHQBSA-N

AC$INSTRUMENT: API2000
AC$INSTRUMENT_TYPE: LC-APPI-QQ
AC$MASS_SPECTROMETRY: MS_TYPE MS2
AC$MASS_SPECTROMETRY: ION_MODE POSITIVE
AC$CHROMATOGRAPHY: RETENTION_TIME 0.820850 min

MS$FOCUSED_ION: BASE_PEAK 273.299988
MS$FOCUSED_ION: PRECURSOR_M/Z 273.300000
MS$FOCUSED_ION: PRECURSOR_TYPE [M-H2O+H]+

PK$SPLASH: splash10-00di-0090000000-80eb6e1af33c4601d6f6
PK$NUM_PEAK: 214
PK$PEAK: m/z int. rel.int.
  66.800003 2701.000000 1
  69.300003 1350.500000 1
  71.099998 1350.500000 1
  78.800003 1350.500000 1
  79.099998 5402.000000 1
  79.400002 1350.500000 1
  80.866667 8103.000000 1
  81.350002 13505.000000 1
  83.099998 8103.000000 1
  83.400002 2701.000000 1
  84.400002 1350.500000 1
  85.037500 21608.000000 1
  89.500000 17556.500000 1
  90.800001 4051.500000 1
  92.699997 1350.500000 1
  92.960001 6752.500000 1
  93.350002 2701.000000 1
  94.000000 1350.500000 1
  94.599998 1350.500000 1
  95.099998 12154.500000 1
  96.300003 1350.500000 1
  97.099998 6752.500000 1
  97.300003 4051.500000 1
  98.599998 1350.500000 1
  99.099998 9453.500000 1
  103.000000 1350.500000 1
  104.400002 2701.000000 1
  104.699997 9453.500000 1
  105.160001 20257.500000 1
  105.900002 1350.500000 1
  106.976787 75628.000000 1
  109.057142 18907.000000 1
  110.199997 1350.500000 1
  110.500000 2701.000000 1
  111.000000 5402.000000 1
  111.300003 1350.500000 1
  112.400002 1350.500000 1
  113.300003 2701.000000 1
  116.400002 1350.500000 1
  116.699997 1350.500000 1
  116.900002 1350.500000 1
  117.199997 2701.000000 1
  118.000000 1350.500000 1
  118.599998 4051.500000 1
  119.019047 28360.500000 1
  119.400002 1350.500000 1
  120.099998 2701.000000 1
  120.300003 1350.500000 1
  120.579999 13505.000000 1
  121.141176 45917.000000 1
  121.674997 5402.000000 1
  122.713334 20257.500000 1
  123.169230 17556.500000 1
  123.800003 1350.500000 1
  124.300003 1350.500000 1
  124.850002 10804.000000 1
  125.300003 6752.500000 1
  125.800003 1350.500000 1
  129.199997 1350.500000 1
  129.399994 1350.500000 1
  129.600006 1350.500000 1
  130.000000 1350.500000 1
  130.600006 2701.000000 1
  130.899994 8103.000000 1
  131.266668 16206.000000 1
  132.300003 4051.500000 1
  133.113044 62123.000000 1
  133.699997 4051.500000 1
  134.000000 1350.500000 1
  135.127779 194472.000000 3
  135.800003 1350.500000 1
  137.130000 27010.000000 1
  137.899994 1350.500000 1
  139.000000 4051.500000 1
  142.300003 1350.500000 1
  142.600006 1350.500000 1
  142.899994 1350.500000 1
  143.199997 2701.000000 1
  143.550003 2701.000000 1
  143.949997 5402.000000 1
  145.137804 221482.000000 3
  146.171428 18907.000000 1
  147.181093 642838.000000 9
  148.000000 1350.500000 1
  149.243332 81030.000000 1
  150.399994 1350.500000 1
  151.254545 44566.500000 1
  153.600006 1350.500000 1
  153.899994 1350.500000 1
  154.199997 1350.500000 1
  156.699997 2701.000000 1
  157.000000 2701.000000 1
  157.399994 2701.000000 1
  157.700005 5402.000000 1
  158.199997 4051.500000 1
  159.100770 351130.000000 5
  160.000000 5402.000000 1
  161.158871 1316737.500000 18
  162.033330 8103.000000 1
  163.120370 145854.000000 2
  165.000003 8103.000000 1
  165.362497 10804.000000 1
  167.100006 1350.500000 1
  170.000000 1350.500000 1
  171.022224 12154.500000 1
  171.316668 8103.000000 1
  172.100006 4051.500000 1
  173.147961 132349.000000 2
  173.949997 2701.000000 1
  175.149607 343027.000000 5
  175.899994 1350.500000 1
  176.100006 1350.500000 1
  177.061110 48618.000000 1
  177.439996 27010.000000 1
  179.000000 1350.500000 1
  179.300003 1350.500000 1
  179.500000 2701.000000 1
  180.800003 1350.500000 1
  181.300003 2701.000000 1
  182.050003 2701.000000 1
  182.500000 1350.500000 1
  183.100006 1350.500000 1
  183.300003 1350.500000 1
  184.100006 2701.000000 1
  185.167504 108040.000000 1
  186.000000 4051.500000 1
  187.189474 128297.500000 2
  187.899994 1350.500000 1
  188.100006 1350.500000 1
  188.699997 6752.500000 1
  189.113335 40515.000000 1
  189.399994 17556.500000 1
  189.899994 1350.500000 1
  190.300003 1350.500000 1
  190.800003 18907.000000 1
  191.220588 91834.000000 1
  195.300003 2701.000000 1
  196.899994 2701.000000 1
  198.275002 5402.000000 1
  199.194797 467273.000000 6
  200.100006 2701.000000 1
  200.500000 4051.500000 1
  201.178001 135050.000000 2
  201.899994 1350.500000 1
  202.199997 1350.500000 1
  203.144576 112091.500000 1
  204.899994 2701.000000 1
  205.199997 4051.500000 1
  205.399994 6752.500000 1
  207.399994 1350.500000 1
  208.899994 1350.500000 1
  209.199997 1350.500000 1
  211.300003 1350.500000 1
  212.150002 5402.000000 1
  213.124052 213379.000000 3
  214.199997 2701.000000 1
  215.233500 270100.000000 4
  216.000000 1350.500000 1
  216.300003 1350.500000 1
  217.000000 22958.500000 1
  217.285713 56721.000000 1
  223.399994 2701.000000 1
  223.899994 1350.500000 1
  225.100006 1350.500000 1
  225.300003 1350.500000 1
  225.800003 2701.000000 1
  226.100006 1350.500000 1
  226.300003 2701.000000 1
  227.240351 153957.000000 2
  228.199997 1350.500000 1
  228.899994 5402.000000 1
  229.399994 9453.500000 1
  229.699997 2701.000000 1
  231.000000 5402.000000 1
  231.300003 2701.000000 1
  237.699997 1350.500000 1
  238.300003 1350.500000 1
  239.399994 1350.500000 1
  239.899994 2701.000000 1
  240.100006 1350.500000 1
  240.300003 2701.000000 1
  240.533335 8103.000000 1
  240.924995 5402.000000 1
  241.299999 10804.000000 1
  241.800003 1350.500000 1
  242.899994 1350.500000 1
  243.300003 1350.500000 1
  244.300003 1350.500000 1
  245.000000 12154.500000 1
  245.800003 1350.500000 1
  250.899994 1350.500000 1
  251.650002 2701.000000 1
  252.000000 1350.500000 1
  252.500000 2701.000000 1
  252.800003 4051.500000 1
  253.150002 2701.000000 1
  253.399994 2701.000000 1
  253.600006 8103.000000 1
  255.312282 13063386.500000 174
  258.424995 5402.000000 1
  258.700012 2701.000000 1
  265.299988 1350.500000 1
  266.399994 1350.500000 1
  267.600006 1350.500000 1
  269.100006 2701.000000 1
  269.399994 4051.500000 1
  269.600006 1350.500000 1
  269.799988 4051.500000 1
  270.000000 4051.500000 1
  270.200012 1350.500000 1
  273.322515 75012172.000000 999
  274.799994 6752.500000 1
  275.100006 1350.500000 1
  275.399994 1350.500000 1