ACCESSION: MSBNK-PFOS_research_group-FFF00190
RECORD_TITLE: Epiandrosterone; LC-APPI-QQ; MS2; CE:20 V; [M-2H2O+H]+
DATE: 2016.01.19 (Created 2011.04.05, modified 2011.06.20)
AUTHORS: Atsushi Yamamoto, PFOS.jp
LICENSE: CC BY-SA
COPYRIGHT: PFOS.jp
COMMENT: Disclaimer: While authors make an effort to ensure that the content of this record is accurate, the authors make no representations or warranties in relation to the accuracy or completeness of the record. This record do not reflect any viewpoints of the affiliation and organization to which the authors belong.

CH$NAME: Epiandrosterone
CH$NAME: 3-beta-Hydroxy-5alpha-androstan-17-one
CH$COMPOUND_CLASS: Natural Product; Steroid hormone
CH$FORMULA: C19H30O2
CH$EXACT_MASS: 290.22458
CH$SMILES: OC(C4)CC([H])(C3)C(C)(C4)C(C2)C(C3)C(C1)C(C)(C2)C(=O)C1
CH$IUPAC: InChI=1S/C19H30O2/c1-18-9-7-13(20)11-12(18)3-4-14-15-5-6-17(21)19(15,2)10-8-16(14)18/h12-16,20H,3-11H2,1-2H3/t12-,13-,14?,15?,16?,18?,19?/m0/s1
CH$LINK: CAS 481-29-8
CH$LINK: LIPIDBANK SST0205
CH$LINK: INCHIKEY QGXBDMJGAMFCBF-CYFBJHQBSA-N

AC$INSTRUMENT: API2000
AC$INSTRUMENT_TYPE: LC-APPI-QQ
AC$MASS_SPECTROMETRY: MS_TYPE MS2
AC$MASS_SPECTROMETRY: ION_MODE POSITIVE
AC$CHROMATOGRAPHY: RETENTION_TIME 0.820833 min

MS$FOCUSED_ION: BASE_PEAK 255.300003
MS$FOCUSED_ION: PRECURSOR_M/Z 255.300000
MS$FOCUSED_ION: PRECURSOR_TYPE [M-2H2O+H]+

PK$SPLASH: splash10-0a4i-0590000000-6e80587be243ad68e4e1
PK$NUM_PEAK: 212
PK$PEAK: m/z int. rel.int.
  38.500000 1350.500000 1
  38.799999 1350.500000 1
  39.000000 1350.500000 1
  39.799999 1350.500000 1
  40.700001 1350.500000 1
  41.000000 2701.000000 1
  41.350000 5402.000000 1
  42.799999 2701.000000 1
  43.250000 2701.000000 1
  44.400002 1350.500000 1
  51.200001 1350.500000 1
  52.700001 1350.500000 1
  53.175000 5402.000000 1
  54.500000 5402.000000 1
  55.030435 62123.000000 1
  55.599998 1350.500000 1
  56.500000 1350.500000 1
  56.700001 4051.500000 1
  59.099998 1350.500000 1
  64.300003 1350.500000 1
  65.000000 2701.000000 1
  65.599998 8103.000000 1
  66.039999 6752.500000 1
  67.053873 383542.000000 3
  67.900002 4051.500000 1
  69.039623 143153.000000 1
  70.750000 8103.000000 1
  71.000000 9453.500000 1
  71.300003 2701.000000 1
  75.300003 1350.500000 1
  76.099998 1350.500000 1
  76.400002 2701.000000 1
  76.800003 9453.500000 1
  77.000000 14855.500000 1
  77.370002 13505.000000 1
  77.883335 8103.000000 1
  79.008122 532097.000000 4
  81.082747 4070407.000000 30
  83.120392 688755.000000 5
  84.300003 1350.500000 1
  85.199997 6752.500000 1
  86.800003 1350.500000 1
  87.000000 1350.500000 1
  87.800003 2701.000000 1
  88.199997 1350.500000 1
  88.400002 1350.500000 1
  89.000000 5402.000000 1
  91.063542 1296480.000000 10
  93.123092 1380211.000000 10
  95.044322 3924553.000000 29
  96.000000 9453.500000 1
  96.199997 8103.000000 1
  97.118274 266048.500000 2
  99.000000 1350.500000 1
  99.300003 1350.500000 1
  99.500000 1350.500000 1
  100.199997 2701.000000 1
  101.099998 1350.500000 1
  101.649998 2701.000000 1
  102.049999 2701.000000 1
  102.400002 1350.500000 1
  105.040856 3913749.000000 29
  107.044797 2466013.000000 18
  109.097211 2033853.000000 15
  109.950001 8103.000000 1
  110.400002 8103.000000 1
  111.064999 108040.000000 1
  112.099998 1350.500000 1
  112.900002 1350.500000 1
  113.300003 1350.500000 1
  114.099998 1350.500000 1
  114.300003 2701.000000 1
  114.962501 10804.000000 1
  115.199997 8103.000000 1
  117.084171 912938.000000 7
  119.076740 1358603.000000 10
  121.100000 2276943.000000 17
  123.097920 1038534.500000 8
  124.862502 21608.000000 1
  125.199997 10804.000000 1
  126.599998 1350.500000 1
  126.850002 5402.000000 1
  127.199997 1350.500000 1
  128.199997 16206.000000 1
  129.055883 183668.000000 1
  131.138058 2029801.500000 15
  133.129464 2617269.000000 19
  135.119011 2131089.000000 16
  137.147253 491582.000000 4
  138.199997 1350.500000 1
  138.399994 1350.500000 1
  139.000000 4051.500000 1
  139.300003 1350.500000 1
  139.500000 2701.000000 1
  140.349998 2701.000000 1
  140.699997 4051.500000 1
  140.899994 8103.000000 1
  141.399994 8103.000000 1
  141.650002 8103.000000 1
  142.199997 12154.500000 1
  143.082403 629333.000000 5
  145.103235 6763304.000000 50
  147.150070 5772037.000000 43
  149.145402 1644909.000000 12
  150.199997 17556.500000 1
  151.165143 945350.000000 7
  152.100001 4051.500000 1
  152.500000 1350.500000 1
  152.699997 1350.500000 1
  153.000000 2701.000000 1
  153.800003 1350.500000 1
  154.199997 1350.500000 1
  155.000000 6752.500000 1
  155.600006 6752.500000 1
  157.166867 448366.000000 3
  159.136598 6620151.000000 49
  161.131386 8528407.500000 63
  163.177078 1072297.000000 8
  164.100006 1350.500000 1
  164.399994 1350.500000 1
  165.000000 1350.500000 1
  165.349998 2701.000000 1
  166.100006 1350.500000 1
  166.699997 1350.500000 1
  167.000000 2701.000000 1
  167.199997 2701.000000 1
  167.449997 2701.000000 1
  168.150002 2701.000000 1
  168.899994 8103.000000 1
  169.174999 10804.000000 1
  169.459998 13505.000000 1
  171.127980 1303232.500000 10
  173.196111 6875395.500000 51
  174.007693 35113.000000 1
  175.182074 1966328.000000 15
  177.231556 633384.500000 5
  180.300003 1350.500000 1
  180.600006 1350.500000 1
  180.950001 5402.000000 1
  181.300003 4051.500000 1
  182.100006 2701.000000 1
  182.399994 1350.500000 1
  183.100006 17556.500000 1
  185.171054 3816513.000000 28
  187.167014 2333664.000000 17
  189.209390 3164221.500000 23
  190.399994 1350.500000 1
  191.100006 2701.000000 1
  192.000000 1350.500000 1
  193.800003 1350.500000 1
  194.100006 1350.500000 1
  194.300003 1350.500000 1
  195.012501 10804.000000 1
  195.337500 10804.000000 1
  195.699997 1350.500000 1
  196.025002 5402.000000 1
  196.600006 6752.500000 1
  197.195831 129648.000000 1
  199.208533 8135412.000000 60
  201.189789 5501937.000000 41
  202.800003 1350.500000 1
  203.899994 1350.500000 1
  207.800003 1350.500000 1
  208.250000 2701.000000 1
  208.800003 1350.500000 1
  209.000000 4051.500000 1
  209.259998 6752.500000 1
  209.699997 1350.500000 1
  210.100001 4051.500000 1
  211.000000 14855.500000 1
  211.236363 29711.000000 1
  211.959998 13505.000000 1
  213.225299 2476817.000000 18
  214.279999 67525.000000 1
  216.600006 1350.500000 1
  219.000000 2701.000000 1
  219.199997 4051.500000 1
  219.800003 1350.500000 1
  222.050003 2701.000000 1
  222.300003 1350.500000 1
  223.239998 27010.000000 1
  223.899994 1350.500000 1
  224.199997 1350.500000 1
  224.650002 5402.000000 1
  225.033335 32412.000000 1
  225.300003 13505.000000 1
  226.189815 145854.000000 1
  227.240181 1196543.000000 9
  234.750000 2701.000000 1
  235.699997 1350.500000 1
  236.100006 1350.500000 1
  236.800003 1350.500000 1
  237.000000 14855.500000 1
  238.150002 2701.000000 1
  239.225002 10804.000000 1
  240.282308 175565.000000 1
  241.199997 1350.500000 1
  241.699997 1350.500000 1
  247.899994 1350.500000 1
  248.300003 2701.000000 1
  249.500000 1350.500000 1
  249.699997 4051.500000 1
  250.800003 2701.000000 1
  251.250000 8103.000000 1
  251.899994 5402.000000 1
  252.430772 17556.500000 1
  253.425001 162060.000000 1
  255.318233 135071608.000000 999
  257.200012 2701.000000 1
  257.399994 4051.500000 1
  257.600006 1350.500000 1
  271.799988 1350.500000 1