ACCESSION: MSBNK-PFOS_research_group-FFF00202
RECORD_TITLE: Progesterone; LC-APPI-QQ; MS2; CE:40 V; [M+H]+
DATE: 2016.01.19 (Created 2011.04.05, modified 2011.06.20)
AUTHORS: Atsushi Yamamoto, PFOS.jp
LICENSE: CC BY-SA
COPYRIGHT: PFOS.jp
COMMENT: Disclaimer: While authors make an effort to ensure that the content of this record is accurate, the authors make no representations or warranties in relation to the accuracy or completeness of the record. This record do not reflect any viewpoints of the affiliation and organization to which the authors belong.

CH$NAME: Progesterone
CH$COMPOUND_CLASS: Natural Product; Steroid hormone
CH$FORMULA: C21H30O2
CH$EXACT_MASS: 314.22458
CH$SMILES: O=C(C4)C=C(C3)C(C)(C4)C(C2)C(C3)C(C1)C(C)(C2)C(C(C)=O)C1
CH$IUPAC: InChI=1S/C21H30O2/c1-13(22)17-6-7-18-16-5-4-14-12-15(23)8-10-20(14,2)19(16)9-11-21(17,18)3/h12,16-19H,4-11H2,1-3H3
CH$LINK: CAS 57-83-0
CH$LINK: INCHIKEY RJKFOVLPORLFTN-UHFFFAOYSA-N

AC$INSTRUMENT: API2000
AC$INSTRUMENT_TYPE: LC-APPI-QQ
AC$MASS_SPECTROMETRY: MS_TYPE MS2
AC$MASS_SPECTROMETRY: ION_MODE POSITIVE
AC$CHROMATOGRAPHY: RETENTION_TIME 0.820833 min

MS$FOCUSED_ION: BASE_PEAK 109.199997
MS$FOCUSED_ION: PRECURSOR_M/Z 315.400000
MS$FOCUSED_ION: PRECURSOR_TYPE [M+H]+

PK$SPLASH: splash10-052b-7900000000-1afc0fc88eca5cbefb08
PK$NUM_PEAK: 297
PK$PEAK: m/z int. rel.int.
  38.200001 1500.500000 1
  39.000000 3001.000000 1
  40.500000 4501.500000 1
  41.113636 33011.000000 1
  43.052207 1767589.000000 39
  44.599998 1500.500000 1
  44.950000 12004.000000 1
  45.400002 3001.000000 1
  50.299999 1500.500000 1
  50.700001 1500.500000 1
  51.000000 6002.000000 1
  53.142858 21007.000000 1
  53.700001 1500.500000 1
  53.950001 3001.000000 1
  55.086364 198066.000000 4
  55.950001 6002.000000 1
  56.425001 6002.000000 1
  57.200000 48016.000000 1
  57.900002 1500.500000 1
  58.400002 1500.500000 1
  58.839999 15005.000000 1
  59.500000 1500.500000 1
  59.900002 1500.500000 1
  63.299999 1500.500000 1
  64.300003 1500.500000 1
  64.987500 12004.000000 1
  65.300003 9003.000000 1
  67.102866 471157.000000 11
  67.900002 3001.000000 1
  68.099998 6002.000000 1
  69.109896 576192.000000 13
  69.800003 4501.500000 1
  71.111142 538679.500000 12
  72.149998 6002.000000 1
  72.699997 3001.000000 1
  73.199997 4501.500000 1
  74.500000 1500.500000 1
  75.199997 3001.000000 1
  75.925001 6002.000000 1
  76.300003 12004.000000 1
  77.101694 177059.000000 4
  79.064753 2273257.500000 51
  81.107074 2969489.500000 66
  83.076018 1989663.000000 44
  85.037455 837279.000000 19
  86.699997 1500.500000 1
  87.166667 9003.000000 1
  88.800003 1500.500000 1
  89.099998 1500.500000 1
  89.300003 3001.000000 1
  91.049470 849283.000000 19
  93.076491 1685061.500000 38
  95.099089 2963487.500000 66
  97.097242 44725403.500000 999
  98.103332 45015.000000 1
  99.133332 22507.500000 1
  101.350002 3001.000000 1
  101.699997 1500.500000 1
  102.300003 1500.500000 1
  103.012500 12004.000000 1
  104.169228 39013.000000 1
  105.073789 1580026.500000 35
  105.699997 28509.500000 1
  107.079551 1805101.500000 40
  109.073514 43383956.500000 969
  111.068493 219073.000000 5
  111.699997 6002.000000 1
  111.900002 1500.500000 1
  112.199997 1500.500000 1
  112.599998 6002.000000 1
  113.244445 27009.000000 1
  113.900002 1500.500000 1
  114.300003 1500.500000 1
  114.875002 6002.000000 1
  115.250000 24008.000000 1
  117.114814 324108.000000 7
  119.097551 1470490.000000 33
  121.094084 1572524.000000 35
  121.857502 60020.000000 1
  123.063333 4276425.000000 96
  124.283335 9003.000000 1
  125.362502 48016.000000 1
  126.400002 1500.500000 1
  126.699997 1500.500000 1
  126.900002 1500.500000 1
  127.249999 18006.000000 1
  127.800001 21007.000000 1
  128.899994 66022.000000 1
  129.156671 90030.000000 2
  131.125381 886795.500000 20
  133.142262 1114871.500000 25
  135.126258 537179.000000 12
  136.300003 12004.000000 1
  137.150632 592697.500000 13
  138.100006 6002.000000 1
  138.983332 9003.000000 1
  139.300003 12004.000000 1
  139.800003 1500.500000 1
  141.266666 54018.000000 1
  143.080740 405135.000000 9
  145.103913 1380460.000000 31
  147.158072 1245415.000000 28
  149.111270 732244.000000 16
  150.262501 12004.000000 1
  151.224998 36012.000000 1
  152.050003 3001.000000 1
  152.600006 1500.500000 1
  153.000000 4501.500000 1
  153.374996 6002.000000 1
  153.799998 4501.500000 1
  154.237499 12004.000000 1
  155.126667 90030.000000 2
  156.063637 66022.000000 1
  157.142130 648216.000000 14
  159.137819 1527509.000000 34
  161.148305 708236.000000 16
  162.370584 25508.500000 1
  163.149890 679726.500000 15
  163.899994 4501.500000 1
  165.133337 31510.500000 1
  165.600006 3001.000000 1
  166.250000 3001.000000 1
  167.114285 21007.000000 1
  168.221052 28509.500000 1
  169.128571 147049.000000 3
  171.113425 871790.500000 19
  173.154812 670723.500000 15
  175.181212 495165.000000 11
  176.100006 7502.500000 1
  176.330000 15005.000000 1
  177.202809 534178.000000 12
  178.199997 3001.000000 1
  179.194285 52517.500000 1
  179.800003 1500.500000 1
  180.000000 6002.000000 1
  181.104762 63021.000000 1
  182.110346 43514.500000 1
  183.118010 316605.500000 7
  184.111111 54018.000000 1
  185.192064 378126.000000 8
  186.046668 22507.500000 1
  187.155696 474158.000000 11
  188.199997 9003.000000 1
  189.228986 414138.000000 9
  189.800003 1500.500000 1
  190.100006 3001.000000 1
  191.227272 198066.000000 4
  192.300003 4501.500000 1
  192.525002 6002.000000 1
  192.937496 12004.000000 1
  193.333333 18006.000000 1
  194.184620 19506.500000 1
  195.191304 138046.000000 3
  196.089999 30010.000000 1
  196.500000 16505.500000 1
  197.210439 273091.000000 6
  199.249106 336112.000000 8
  200.300003 18006.000000 1
  201.180374 321107.000000 7
  202.250000 15005.000000 1
  203.186208 87029.000000 2
  203.899994 1500.500000 1
  204.100006 3001.000000 1
  204.399994 1500.500000 1
  204.800003 9003.000000 1
  205.278259 34511.500000 1
  205.600006 6002.000000 1
  206.500000 1500.500000 1
  207.300003 19506.500000 1
  207.855554 13504.500000 1
  209.171171 166555.500000 4
  210.366669 36012.000000 1
  211.171970 198066.000000 4
  212.166667 9003.000000 1
  212.399994 10503.500000 1
  213.277777 432144.000000 10
  215.191129 372124.000000 8
  216.459998 7502.500000 1
  217.100006 16505.500000 1
  217.300003 15005.000000 1
  218.300000 7502.500000 1
  218.699997 4501.500000 1
  218.937496 12004.000000 1
  219.322222 13504.500000 1
  220.600006 3001.000000 1
  221.000000 19506.500000 1
  221.399994 6002.000000 1
  222.000000 6002.000000 1
  223.163269 147049.000000 3
  223.899994 10503.500000 1
  224.235298 25508.500000 1
  225.285712 42014.000000 1
  225.899994 7502.500000 1
  227.279882 253584.500000 6
  227.899994 4501.500000 1
  228.199997 12004.000000 1
  228.912495 36012.000000 1
  229.234210 57019.000000 1
  230.000000 4501.500000 1
  230.237499 12004.000000 1
  231.234616 78026.000000 2
  232.399994 1500.500000 1
  232.969998 15005.000000 1
  233.283333 18006.000000 1
  233.899994 3001.000000 1
  234.399994 1500.500000 1
  235.309999 30010.000000 1
  236.255554 13504.500000 1
  237.261403 85528.500000 2
  238.000000 4501.500000 1
  238.199997 10503.500000 1
  239.297222 432144.000000 10
  240.300003 7502.500000 1
  241.184000 150050.000000 3
  242.100006 7502.500000 1
  242.325001 6002.000000 1
  242.600006 1500.500000 1
  242.800003 1500.500000 1
  243.422223 13504.500000 1
  243.724998 6002.000000 1
  244.000000 4501.500000 1
  244.300003 9003.000000 1
  245.348147 40513.500000 1
  246.899994 1500.500000 1
  247.300003 4501.500000 1
  247.600006 1500.500000 1
  247.800003 1500.500000 1
  249.200000 33011.000000 1
  250.060001 7502.500000 1
  250.500000 16505.500000 1
  251.078571 42014.000000 1
  252.399994 1500.500000 1
  253.261363 132044.000000 3
  254.312496 24008.000000 1
  255.312012 499666.500000 11
  256.183339 18006.000000 1
  257.226090 69023.000000 2
  258.274994 6002.000000 1
  258.725006 6002.000000 1
  259.240002 15005.000000 1
  261.100006 1500.500000 1
  261.299988 1500.500000 1
  262.200012 1500.500000 1
  262.500000 1500.500000 1
  263.399994 1500.500000 1
  264.379993 15005.000000 1
  264.799988 1500.500000 1
  265.200012 1500.500000 1
  266.899994 4501.500000 1
  267.200012 6002.000000 1
  267.500000 3001.000000 1
  267.899994 1500.500000 1
  268.150009 6002.000000 1
  268.449997 3001.000000 1
  269.000000 13504.500000 1
  269.207153 21007.000000 1
  269.750000 9003.000000 1
  270.200012 6002.000000 1
  271.263641 33011.000000 1
  271.899994 10503.500000 1
  272.190012 15005.000000 1
  273.321669 90030.000000 2
  277.449997 6002.000000 1
  277.799988 1500.500000 1
  278.200012 3001.000000 1
  279.297181 213071.000000 5
  281.000000 3001.000000 1
  281.299988 1500.500000 1
  281.799988 1500.500000 1
  282.125008 6002.000000 1
  282.399994 1500.500000 1
  282.600006 4501.500000 1
  283.250000 12004.000000 1
  283.899994 1500.500000 1
  284.399994 1500.500000 1
  284.899994 7502.500000 1
  285.399994 1500.500000 1
  285.600006 1500.500000 1
  285.949997 6002.000000 1
  286.299988 3001.000000 1
  286.600006 3001.000000 1
  286.833323 9003.000000 1
  287.400002 12004.000000 1
  295.000000 3001.000000 1
  295.200012 1500.500000 1
  296.100006 1500.500000 1
  297.291726 435145.000000 10
  299.000000 1500.500000 1
  299.700002 4501.500000 1
  300.000000 7502.500000 1
  300.283325 9003.000000 1
  300.575005 12004.000000 1
  313.200012 1500.500000 1
  313.399994 1500.500000 1
  314.150002 6002.000000 1
  315.263559 354118.000000 8
  316.100006 1500.500000 1