ACCESSION: MSBNK-PFOS_research_group-FFF00227
RECORD_TITLE: Dihydrotestosterone; LC-APPI-QQ; MS2; CE:40 V; [M+CH3]+
DATE: 2016.01.19 (Created 2011.04.05, modified 2011.06.20)
AUTHORS: Atsushi Yamamoto, PFOS.jp
LICENSE: CC BY-SA
COPYRIGHT: PFOS.jp
COMMENT: Disclaimer: While authors make an effort to ensure that the content of this record is accurate, the authors make no representations or warranties in relation to the accuracy or completeness of the record. This record do not reflect any viewpoints of the affiliation and organization to which the authors belong.

CH$NAME: Dihydrotestosterone
CH$COMPOUND_CLASS: Natural Product; Steroid hormone
CH$FORMULA: C19H30O2
CH$EXACT_MASS: 290.22458
CH$SMILES: O=C(C4)CC([H])(C3)C(C)(C4)C(C2)C(C3)C(C1)C(C)(C2)C(O)C1
CH$IUPAC: InChI=1S/C19H30O2/c1-18-9-7-13(20)11-12(18)3-4-14-15-5-6-17(21)19(15,2)10-8-16(14)18/h12,14-17,21H,3-11H2,1-2H3/t12-,14?,15?,16?,17-,18?,19?/m0/s1
CH$LINK: CAS 521-18-6
CH$LINK: LIPIDBANK SST0297
CH$LINK: INCHIKEY NVKAWKQGWWIWPM-FMFZMMAASA-N

AC$INSTRUMENT: API2000
AC$INSTRUMENT_TYPE: LC-APPI-QQ
AC$MASS_SPECTROMETRY: MS_TYPE MS2
AC$MASS_SPECTROMETRY: ION_MODE POSITIVE
AC$CHROMATOGRAPHY: RETENTION_TIME 0.820833 min

MS$FOCUSED_ION: BASE_PEAK 85.400002
MS$FOCUSED_ION: PRECURSOR_M/Z 305.400000
MS$FOCUSED_ION: PRECURSOR_TYPE [M+CH3]+

PK$SPLASH: splash10-053j-8910000000-68b188fa4a00bf7c112c
PK$NUM_PEAK: 319
PK$PEAK: m/z int. rel.int.
  39.400002 1500.500000 1
  40.599998 3001.000000 1
  40.799999 3001.000000 1
  41.299999 6002.000000 1
  43.082609 34511.500000 8
  44.599998 1500.500000 1
  44.900002 3001.000000 1
  45.099998 3001.000000 1
  45.350000 3001.000000 1
  50.200001 1500.500000 1
  50.599998 1500.500000 1
  50.950001 3001.000000 1
  51.400002 3001.000000 1
  52.299999 1500.500000 1
  52.850000 6002.000000 1
  53.200001 3001.000000 1
  53.400002 4501.500000 1
  55.090441 408136.000000 91
  56.000000 1500.500000 1
  56.883334 27009.000000 6
  57.400002 16505.500000 4
  57.799999 1500.500000 1
  58.250000 6002.000000 1
  58.980000 30010.000000 7
  63.799999 1500.500000 1
  64.650000 6002.000000 1
  65.099998 4501.500000 1
  65.366669 9003.000000 2
  65.599998 1500.500000 1
  67.100000 597199.000000 133
  68.371431 21007.000000 5
  69.116666 216072.000000 48
  70.033333 9003.000000 2
  71.072413 174058.000000 39
  72.000000 3001.000000 1
  73.176470 25508.500000 6
  75.099998 1500.500000 1
  77.100001 72024.000000 16
  79.003093 873291.000000 194
  81.097833 2630376.500000 584
  82.000000 12004.000000 3
  82.500000 21007.000000 5
  83.116868 249083.000000 55
  85.090791 4496998.500000 999
  86.139998 7502.500000 2
  86.400002 1500.500000 1
  86.699997 1500.500000 1
  86.900002 1500.500000 1
  88.400002 1500.500000 1
  88.699997 1500.500000 1
  89.099998 3001.000000 1
  91.048500 600200.000000 133
  93.102799 1179393.000000 262
  95.071972 1263421.000000 281
  96.025000 6002.000000 1
  96.400002 10503.500000 2
  97.164748 208569.500000 46
  98.900002 18006.000000 4
  99.199997 7502.500000 2
  99.400002 6002.000000 1
  101.900002 1500.500000 1
  102.199997 1500.500000 1
  102.500000 1500.500000 1
  102.800003 6002.000000 1
  103.174997 6002.000000 1
  103.800003 10503.500000 2
  105.040333 900300.000000 200
  105.800003 7502.500000 2
  107.078082 766755.500000 170
  109.108181 330110.000000 73
  110.000000 4501.500000 1
  110.574999 6002.000000 1
  111.102985 100533.500000 22
  111.699997 1500.500000 1
  111.900002 1500.500000 1
  112.099998 1500.500000 1
  112.500000 1500.500000 1
  113.235000 30010.000000 7
  114.400002 1500.500000 1
  115.099998 7502.500000 2
  115.800003 6002.000000 1
  117.089534 258086.000000 57
  118.199997 34511.500000 8
  119.069091 825275.000000 183
  119.900002 12004.000000 3
  121.126210 744248.000000 165
  121.750000 9003.000000 2
  122.342858 21007.000000 5
  123.044067 177059.000000 39
  124.049999 3001.000000 1
  124.400002 6002.000000 1
  125.087499 24008.000000 5
  125.500000 4501.500000 1
  125.699997 3001.000000 1
  126.599998 1500.500000 1
  127.099998 4501.500000 1
  128.000000 13504.500000 3
  129.076362 165055.000000 37
  129.959998 30010.000000 7
  131.120082 732244.000000 163
  133.145727 702234.000000 156
  135.150765 490663.500000 109
  135.950001 6002.000000 1
  136.500000 3001.000000 1
  137.087096 46515.500000 10
  138.050003 3001.000000 1
  138.600006 6002.000000 1
  138.899994 9003.000000 2
  139.183337 18006.000000 4
  140.300003 1500.500000 1
  140.949997 6002.000000 1
  141.399997 15005.000000 3
  142.100004 18006.000000 4
  143.101036 289596.500000 64
  145.130711 1182394.000000 263
  145.944444 27009.000000 6
  147.181884 621207.000000 138
  147.899994 7502.500000 2
  149.179488 117039.000000 26
  150.100006 1500.500000 1
  150.300003 1500.500000 1
  151.214815 40513.500000 9
  152.800003 6002.000000 1
  153.250000 6002.000000 1
  153.600006 1500.500000 1
  154.100006 1500.500000 1
  154.399994 1500.500000 1
  155.100001 16505.500000 4
  155.575005 6002.000000 1
  156.142859 21007.000000 5
  157.143821 267089.000000 59
  159.149375 1200400.000000 267
  159.899994 4501.500000 1
  161.166481 810270.000000 180
  161.899994 3001.000000 1
  162.399994 4501.500000 1
  163.067504 60020.000000 13
  163.699997 1500.500000 1
  164.100006 1500.500000 1
  164.300003 1500.500000 1
  164.500000 1500.500000 1
  165.138712 46515.500000 10
  165.699997 3001.000000 1
  166.050003 3001.000000 1
  166.399994 3001.000000 1
  167.100006 3001.000000 1
  167.399994 3001.000000 1
  168.100006 6002.000000 1
  168.500000 4501.500000 1
  169.099999 28509.500000 6
  171.094410 483161.000000 107
  173.183387 939313.000000 209
  173.899994 1500.500000 1
  175.159259 202567.500000 45
  177.081823 33011.000000 7
  177.899994 1500.500000 1
  178.199997 1500.500000 1
  178.399994 1500.500000 1
  178.971427 10503.500000 2
  179.399994 9003.000000 2
  180.000000 3001.000000 1
  180.399994 1500.500000 1
  180.949997 3001.000000 1
  181.300003 3001.000000 1
  182.075005 6002.000000 1
  182.399999 9003.000000 2
  182.899994 6002.000000 1
  183.199997 10503.500000 2
  183.399994 12004.000000 3
  185.164667 450150.000000 100
  186.011765 51017.000000 11
  187.214054 277592.500000 62
  188.000000 3001.000000 1
  188.399994 9003.000000 2
  189.238596 171057.000000 38
  190.100006 3001.000000 1
  190.474998 6002.000000 1
  191.133336 27009.000000 6
  191.500000 10503.500000 2
  191.699997 1500.500000 1
  192.300003 1500.500000 1
  193.000000 3001.000000 1
  193.300003 3001.000000 1
  193.699997 1500.500000 1
  194.849998 3001.000000 1
  195.100006 3001.000000 1
  195.399994 3001.000000 1
  195.899994 3001.000000 1
  196.100006 3001.000000 1
  196.300003 3001.000000 1
  196.800003 7502.500000 2
  197.042860 21007.000000 5
  197.399994 6002.000000 1
  198.158334 18006.000000 4
  198.399994 7502.500000 2
  199.233953 565688.500000 126
  200.100006 19506.500000 4
  201.178804 276092.000000 61
  202.200000 7502.500000 2
  203.022224 13504.500000 3
  203.325001 6002.000000 1
  203.600006 3001.000000 1
  203.800003 1500.500000 1
  204.100006 1500.500000 1
  204.399994 4501.500000 1
  205.000000 3001.000000 1
  205.250000 9003.000000 2
  205.849998 3001.000000 1
  207.100006 1500.500000 1
  207.300003 1500.500000 1
  209.100006 1500.500000 1
  209.349998 3001.000000 1
  210.500000 1500.500000 1
  211.100006 6002.000000 1
  211.449997 9003.000000 2
  212.000000 9003.000000 2
  213.218867 238579.500000 53
  215.204015 411137.000000 91
  216.300003 1500.500000 1
  216.500000 3001.000000 1
  217.088894 27009.000000 6
  217.600006 7502.500000 2
  218.100006 3001.000000 1
  218.416662 9003.000000 2
  218.699997 1500.500000 1
  219.000000 1500.500000 1
  219.300003 6002.000000 1
  220.449997 3001.000000 1
  221.199997 1500.500000 1
  221.449997 3001.000000 1
  223.199997 1500.500000 1
  224.199997 1500.500000 1
  224.899994 3001.000000 1
  225.275002 6002.000000 1
  225.600006 1500.500000 1
  226.100006 9003.000000 2
  226.500000 7502.500000 2
  227.293548 46515.500000 10
  228.250000 3001.000000 1
  228.500000 3001.000000 1
  229.286664 45015.000000 10
  231.173912 34511.500000 8
  231.899994 1500.500000 1
  232.250000 3001.000000 1
  232.600006 1500.500000 1
  232.962498 12004.000000 3
  233.339999 30010.000000 7
  233.899994 6002.000000 1
  234.174999 6002.000000 1
  235.300003 1500.500000 1
  235.500000 1500.500000 1
  236.300003 3001.000000 1
  236.949997 3001.000000 1
  239.300003 1500.500000 1
  239.933329 9003.000000 2
  240.474998 12004.000000 3
  240.800003 3001.000000 1
  241.060001 7502.500000 2
  242.199997 1500.500000 1
  242.800003 1500.500000 1
  243.199997 3001.000000 1
  243.500000 1500.500000 1
  244.000000 1500.500000 1
  244.199997 1500.500000 1
  244.899994 6002.000000 1
  245.239999 15005.000000 3
  245.899994 6002.000000 1
  246.899994 6002.000000 1
  247.250000 3001.000000 1
  247.550003 3001.000000 1
  249.000000 1500.500000 1
  249.299995 6002.000000 1
  251.399994 3001.000000 1
  252.699997 1500.500000 1
  253.139999 7502.500000 2
  253.525002 6002.000000 1
  253.899994 1500.500000 1
  254.100006 1500.500000 1
  255.311429 997832.500000 222
  256.100006 1500.500000 1
  256.399994 1500.500000 1
  257.100006 3001.000000 1
  257.299988 1500.500000 1
  257.500000 3001.000000 1
  258.100006 4501.500000 1
  259.000000 3001.000000 1
  259.399994 4501.500000 1
  260.100006 3001.000000 1
  260.799988 3001.000000 1
  261.100006 3001.000000 1
  261.299988 1500.500000 1
  262.200012 3001.000000 1
  262.399994 1500.500000 1
  262.600006 1500.500000 1
  271.399994 1500.500000 1
  272.200012 1500.500000 1
  272.500000 1500.500000 1
  272.899994 10503.500000 2
  273.429409 51017.000000 11
  274.500000 1500.500000 1
  275.399994 6002.000000 1
  276.000000 6002.000000 1
  276.399994 1500.500000 1
  277.000000 1500.500000 1
  277.299988 1500.500000 1
  277.600006 1500.500000 1
  286.600006 1500.500000 1
  287.200012 1500.500000 1
  287.449997 6002.000000 1
  288.799988 1500.500000 1
  289.449997 3001.000000 1
  289.799988 1500.500000 1
  290.050003 3001.000000 1
  290.299988 1500.500000 1
  303.200012 1500.500000 1
  303.899994 1500.500000 1
  304.100006 1500.500000 1
  304.449997 3001.000000 1
  305.343638 165055.000000 37