ACCESSION: MSBNK-PFOS_research_group-FFF00310
RECORD_TITLE: 5mPFOS; LC-ESI-QQ; MS2; 60eV
DATE: 2016.01.19 (Created 2012.06.12)
AUTHORS: Atsushi Yamamoto
LICENSE: CC BY-SA
COPYRIGHT: PFOS.jp
COMMENT: Disclaimer: While authors make an effort to ensure that the content of this record is accurate, the authors make no representations or warranties in relation to the accuracy or completeness of the record. This record do not reflect any viewpoints of the affiliation and organization to which the authors belong.

CH$NAME: 5mPFOS
CH$COMPOUND_CLASS: Non-Natural Product
CH$FORMULA: C8HF17O3S
CH$EXACT_MASS: 499.93749
CH$SMILES: FC(F)(F)C(F)(F)C(F)(C(F)(F)F)C(F)(F)C(F)(F)C(F)(F)C(F)(F)S(O)(=O)=O
CH$IUPAC: InChI=1S/C8HF17O3S/c9-1(6(18,19)20,3(12,13)7(21,22)23)2(10,11)4(14,15)5(16,17)8(24,25)29(26,27)28/h(H,26,27,28)
CH$LINK: INCHIKEY MLMPJIZPFXGYRO-UHFFFAOYSA-N

AC$INSTRUMENT: Xevo TQ, Waters
AC$INSTRUMENT_TYPE: LC-ESI-QQ
AC$MASS_SPECTROMETRY: MS_TYPE MS2
AC$MASS_SPECTROMETRY: ION_MODE NEGATIVE
AC$MASS_SPECTROMETRY: COLLISION_ENERGY 60eV
AC$CHROMATOGRAPHY: RETENTION_TIME 15.925950 min

MS$FOCUSED_ION: BASE_PEAK 79.580612
MS$FOCUSED_ION: PRECURSOR_M/Z 498.9
MS$FOCUSED_ION: PRECURSOR_TYPE [M-H]-

PK$SPLASH: splash10-004i-9410000000-ea8ffb5040a02d4b82cd
PK$NUM_PEAK: 8
PK$PEAK: m/z int. rel.int.
  68.988394 2891.800817 95
  79.760324 30250.510572 999
  98.706874 9726.413760 321
  129.667720 20642.211604 682
  180.152133 2434.384532 80
  229.321354 4218.435080 139
  273.624466 945.201613 31
  338.901669 886.068742 29